{"text_format":"1","workbook":"xlsx","n_sheets":4,"sheets":["Pdiss & Compensation","Control Loop1","Control Loop2","Diode Curve"],"not_rendered":{"charts":13,"images":1,"macros":1,"external_links":0,"defined_names":166,"comments":1,"pivot_tables":0},"unopened":[],"bounds":{"document_bytes":16777216,"sheet_cells":100000,"rows_first":2000,"rows_last":500,"rows_between":2000,"halvings":0,"cell_chars":16384,"cell_head_chars":4096},"cells_cut":0,"cells_raw":0,"read":"whole","date_system":"1900"}

{"sheet":"Pdiss & Compensation","index":0,"n_rows":182,"n_cols":66,"rows_kept":182,"cut":false,"hidden":false,"merged":[[112,1,112,3],[133,3,134,3],[33,1,34,1],[33,3,34,3],[36,1,36,3],[46,1,46,3],[58,1,58,3],[78,1,78,3],[94,3,95,3],[59,1,60,1],[71,1,71,3],[102,1,102,3]]}
["A4413 Estimated Power Dissipation and Compensation Worksheet",null,null,null,null,null,"Reset =",0,null,null,null,null,null,null,null,null,null,null,null,null,null,null,null,null,null,null,null,null,null,null,null,null,null,null,null,null,null,null,0]
[null,"= Design Entry",null,"If any cells give an error try clicking on \"Converge\"",null,null,"Buck","Vin",{"$f":"Vin_nom","v":12},{"$f":"Vin_min","v":3.5},{"$f":"J2+(Vin_max-Vin_min)/49","v":3.795918367346939},4.091836734693878,4.387755102040817,4.683673469387756,4.979591836734695,5.275510204081634,5.571428571428573,5.8673469387755119,6.1632653061224509,6.4591836734693899,6.7551020408163289,7.0510204081632679,7.3469387755102069,7.6428571428571459,7.9387755102040849,8.2346938775510239,8.5306122448979629,8.8265306122449019,9.1224489795918409,9.4183673469387799,9.7142857142857189,10.010204081632658,10.306122448979597,10.602040816326536,10.897959183673475,11.193877551020414,11.489795918367353,11.785714285714292,12.081632653061231,12.37755102040817,12.673469387755109,12.969387755102048,{"$f":"AP2+(Vin_max-Vin_min)/49","v":13.265306122448987},13.561224489795926,13.857142857142865,14.153061224489804,14.448979591836743,14.744897959183682,15.040816326530621,15.33673469387756,15.632653061224499,15.928571428571438,16.224489795918377,16.520408163265316,16.816326530612255,17.112244897959194,17.408163265306133,17.704081632653072,18.000000000000011,{"$f":"V_AbsMax","v":36},"Vin"]
[null,"** Ensure iterative calculations are enabled **",null,null,null,null,"Buck-Boost","Pdiss total",{"$f":"I33+I36+I59+I62+I65+I68+I21*Icc+I52+I56","v":0.49594354017553727},0.86093588500828466,0.76345822276713871,0.68736258832376385,0.62511415034834394,0.57803034192078351,0.54190823696337753,0.51394094773654775,0.49217564676753911,0.47528049842506875,0.46227205935022386,0.45241125632478946,0.44514066492003984,0.43176425446346656,0.42320641603953113,0.42500710653921325,0.42727832339822175,0.4299926344116089,0.43312631912791721,0.4366587641058462,0.44057197220147915,0.44485016166683344,0.44947943652188571,0.45444751389336624,0.4597434971926726,0.46535768641392145,0.47128141867266005,0.47750693352121604,0.48402725867362739,0.49083611262902271,0.4979278213545017,0.50529724671969434,{"$f":"AO33+AO36+AO59+AO62+AO65+AO68+AO21*Icc+AO52+AO56","v":0.51293972479731831},0.52085101248143895,0.52902724114623756,0.53746487628702388,0.54616068226290571,0.55511169140538508,0.56431517687578692,0.57376862875199186,0.58346973290552373,0.59341635229684253,0.60360651037228807,0.61403837629255409,0.62471025176148698,0.63562055925673699,0.64676783149139816,0.65815070195914305,0.66976789643520007,0.68161822530518679,0.69370057665345819,1.1085344632678293,"Pdiss total","Buck-Boost"]
[null,"Select Topology:","Buck-Boost","Select either Buck or Buck-Boost operation",null,null,null,"Tj",{"$f":"IF(Reset=1,150,Ta+Rth_ja*I3)","v":139.87830620526611},{"$f":"IF(Reset=1,150,Ta+Rth_ja*J3)","v":150.82807655024854},{"$f":"IF(Reset=1,150,Ta+Rth_ja*K3)","v":147.90374668301416},145.62087764971292,143.75342451045032,142.34091025762351,141.25724710890131,140.41822843209644,139.76526940302617,139.25841495275205,138.86816178050671,138.57233768974368,138.35421994760119,137.95292763390398,137.69619248118593,137.75021319617639,137.81834970194666,137.89977903234828,137.99378957383752,138.09976292317538,138.21715916604438,138.345504850005,138.48438309565657,138.63342541680097,138.79230491578016,138.96073059241763,139.13844256017981,139.32520800563648,139.52081776020881,139.72508337887069,139.93783464063506,140.15891740159083,140.38819174391955,{"$f":"IF(Reset=1,150,Ta+Rth_ja*AP3)","v":140.62553037444317},140.87081723438712,141.12394628861071,141.38482046788718,141.65335074216156,141.92945530627361,142.21305886255976,142.50409198716571,142.80249056890528,143.10819531116863,143.42115128877663,143.7413075528446,144.06861677770212,144.40303494474193,144.7445210587743,145.093036893056,145.44854675915559,145.81101729960375,{"$f":"IF(Reset=1,150,Ta+Rth_ja*BH3)","v":158.25603389803487},"Tj"]
[null,null,null,null,null,null,"Yes",null,null,{"$f":"J2","v":3.5},{"$f":"K2","v":3.795918367346939},4.091836734693878,4.387755102040817,4.683673469387756,4.979591836734695,5.275510204081634,5.571428571428573,5.8673469387755119,6.1632653061224509,6.4591836734693899,6.7551020408163289,7.0510204081632679,7.3469387755102069,7.6428571428571459,7.9387755102040849,8.2346938775510239,8.5306122448979629,8.8265306122449019,9.1224489795918409,9.4183673469387799,9.7142857142857189,10.010204081632658,10.306122448979597,10.602040816326536,10.897959183673475,11.193877551020414,11.489795918367353,11.785714285714292,12.081632653061231,12.37755102040817,12.673469387755109,12.969387755102048,13.265306122448987,13.561224489795926,13.857142857142865,14.153061224489804,14.448979591836743,14.744897959183682,15.040816326530621,15.33673469387756,15.632653061224499,15.928571428571438,16.224489795918377,16.520408163265316,16.816326530612255,17.112244897959194,17.408163265306133,17.704081632653072,18.000000000000011,36]
[null,"Vin nom",12,"Enter nominal operating voltage here",null,null,"No"]
[null,"Vin min (Buck Boost)",3.5,"Enter minimum voltage for Buck Boost mode"]
[null,"Vin min (Buck)",6,"Enter minimum voltage for Buck mode",null,null,"Buck Boost Mode Calculations",null,{"$f":"IF(I14>I12,\"Boost >\",\"buck >\")","v":"buck >"},"buck >","buck >","buck >","buck >","buck >","buck >","buck >","buck >","buck >","buck >","buck >","buck >","buck >","buck >","buck >","buck >","buck >","buck >","buck >","buck >","buck >","buck >","buck >","buck >","buck >","buck >","buck >","buck >","buck >","buck >","buck >",{"$f":"IF(AO14>AO12,\"Boost >\",\"buck >\")","v":"buck >"},"buck >","buck >","buck >","buck >","buck >","buck >","buck >","buck >","buck >","buck >","buck >","buck >","buck >","buck >","buck >","buck >","buck >","buck >","buck >",null,"Buck Boost Mode Calculations"]
[null,"Vin max (operating)",18,"Enter maximum operating voltage. This is used for plots.",null,null,null,"V1",{"$f":"IF(Reset=1,I2-Vreg,IF(I14=0,I2-(I22-I23/2)*(I30+dcr*10^-3)-I21-I75,I2-(I22-I23/2)*(I30+R_ds_ON_boost+dcr*10^-3)))","v":6.0397771329644945},{"$f":"IF(Reset=1,J2,IF(J14=0,J2-(J22-J23/2)*(J30+dcr*10^-3)-J21-J75,J2-(J22-J23/2)*(J30+R_ds_ON_boost+dcr*10^-3)))","v":2.8167084617904665},3.1749311188888916,3.5225714992206338,3.8616978324177853,4.1946480734868228,4.5225899884960867,4.8463876741409635,5.1666948692962871,5.4840277739904195,5.7987912237450079,6.1113078171253958,6.4218393956225128,6.7448095183177506,1.3894628434723146,1.6850512567971885,1.9806823440445376,2.2763483757612599,2.5720430568110628,2.8677612286921854,3.1634986403531657,3.4592517702329557,3.7550176869745071,4.0507939395967041,4.3465784702923829,4.6423695447404638,4.9381656960744396,5.2339656795724778,5.5297684358196433,5.8255730606055662,6.1213787802078139,6.4171849310051883,6.7129909425901522,{"$f":"IF(Reset=1,AP2,IF(AP14=0,AP2-(AP22-AP23/2)*(AP30+dcr*10^-3)-AP21-AP75,AP2-(AP22-AP23/2)*(AP30+R_ds_ON_boost+dcr*10^-3)))","v":7.0087963237228257},7.3046006506033141,7.6004035570438679,7.8962047262044157,8.1920038836198117,8.4878007912983868,8.7835952427122468,9.0793870585324523,9.375176082988455,9.6709621807523778,9.9667452342658844,10.262525141441394,10.558301813680746,10.854075174163878,11.14984515636764,11.445611702781369,11.741374764178822,12.03713429876171,30.029991636788552,"V1"]
[null,"Vin abs max",36,"Enter abs maximum voltage.",null,null,null,"V2",{"$f":"IF(Reset=1,0,IF(I12>I14,IF(I14=0,0,Vreg+I71+(I22-I23/2)*(I30+dcr*10^-3)-I2),I71+(I22-I23/2)*(R_ds_ON_boost+dcr*10^-3)))","v":0},{"$f":"IF(Reset=1,J71,IF(J12>J14,IF(J14=0,0,Vreg+J71+(J22-J23/2)*(J30+dcr*10^-3)-J2),J71+(J22-J23/2)*(R_ds_ON_boost+dcr*10^-3)))","v":2.9295847689754204},2.5633728962877811,2.2085434083875786,1.8625894270986993,1.5239455957002406,1.1911830450530605,0.86296259680341603,0.5374737005449477,0.21561273092643063,-0.10311970792577441,-0.41912211139625999,-0.73271663859439862,-1.058429085037214,0,0,0,0,0,0,0,0,0,0,0,0,0,0,0,0,0,0,0,{"$f":"IF(Reset=1,AP71,IF(AP12>AP14,IF(AP14=0,0,Vreg+AP71+(AP22-AP23/2)*(AP30+dcr*10^-3)-AP2),AP71+(AP22-AP23/2)*(R_ds_ON_boost+dcr*10^-3)))","v":0},0,0,0,0,0,0,0,0,0,0,0,0,0,0,0,0,0,0,"V2"]
[null,"Switching frequency",2000,"Enter nominal switching frequency",null,null,"ton min (LG)","V3",{"$f":"IF(Reset=1,Vreg,Vreg+I71+I75+(I22-I23/2)*dcr*10^-3)","v":6.1230770068451745},{"$f":"Vreg+J71+J75+(J22-J23/2)*dcr*10^-3","v":6.4195487864582725},6.3796665328302762,6.3456148191158119,6.3160939482265093,6.2906648406604306,6.2685518467348365,6.2488845185921065,6.2300624574183239,6.2120610875889142,6.1960420027812955,6.1817496145986013,6.1689758089970734,6.157504967770131,6.1312690653663138,6.1305751841249352,6.1299087603376456,6.1292692838682905,6.1286559947178274,6.1280679759353323,6.1275042189650684,6.1269636694917473,6.1264452594121739,6.1259479288955649,6.1254706413431483,6.1250123932538596,6.1245722204372761,6.1241492016136716,6.123742460154487,6.1233511645104519,6.1229745277257219,6.1226118063281305,6.1222622988067688,{"$f":"Vreg+AP71+AP75+(AP22-AP23/2)*dcr*10^-3","v":6.1219253438302479},6.121600318316573,6.1212866354342728,6.1209837425914619,6.1206911194524594,6.1204082760091394,6.1201347507249739,6.1198701087629779,6.1196139403039025,6.119365858957412,6.1191255002665033,6.1188925203036302,6.1186665943557479,6.118447415694745,6.1182346944291721,6.1180281564329304,6.117827541799973,6.1176326037589206,6.113417949097725,"V3"]
[null,"FSET Resistor (RFSET) = ",{"$f":"21956/fsw - 2.315","v":8.6630000000000003},"Required frequency setting resistor (KΩ), use the closest available 1% value",null,null,55,"Buck duty",{"$f":"IF(Reset=1,0.7,IF(I14=0,IF(I11/(I9+I11)>1,1,I11/(I9+I11)),IF(IF((I11*(1-I14)+I10*I14)/(I9+I10)>I14,(I10*I14-I11+I9*I14)/(I10-I11),(I11*(1-I14)+I10*I14)/(I9+I10))>$M$169,$M$169,IF((I11*(1-I14)+I10*I14)/(I9+I10)>I14,(I10*I14-I11+I9*I14)/(I10-I11),(I11*(1-I14)+I10*I14)/(I9+I10)))))","v":0.50342435553872322},0.84000000000000008,0.84000000000000008,0.83421495842271443,0.81726594902129091,0.80375628310462732,0.79281419633720285,0.78379943990026069,0.77615124814208092,0.76968665623393329,0.76422389118158873,0.75957899111801974,0.75560936612620855,0.75071570582514324,0.81524898636004173,0.78439971900724847,0.75579062998572721,0.72918725691104269,0.70438661979015327,0.68121213025954419,0.65950945358063318,0.63914312254051542,0.61999374916974315,0.60195571510581636,0.58493524772884387,0.56884880916509839,0.55362174053640301,0.53918711561527322,0.5254847671932088,0.51246045661913942,0.5000651625887369,0.48825446971560316,{"$f":"IF(Reset=1,0.7,IF(AO14=0,IF(AO11/(AO9+AO11)>1,1,AO11/(AO9+AO11)),IF(IF((AO11*(1-AO14)+AO10*AO14)/(AO9+AO10)>AO14,(AO10*AO14-AO11+AO9*AO14)/(AO10-AO11),(AO11*(1-AO14)+AO10*AO14)/(AO9+AO10))>$M$169,$M$169,IF((AO11*(1-AO14)+AO10*AO14)/(AO9+AO10)>AO14,(AO10*AO14-AO11+AO9*AO14)/(AO10-AO11),(AO11*(1-AO14)+AO10*AO14)/(AO9+AO10)))))","v":0.47698804095745717},0.46622916080522453,0.45594433842360732,0.4461029617757874,0.43667699526317882,0.42764071463401065,0.41897047391704711,0.41064449996208618,0.40264271085110886,0.39494655501008186,0.38753886832295853,0.38040374694359896,0.37352643383196771,0.36689321731923485,0.36049134024135121,0.35430891837964568,0.34833486711601347,0.3425588353266979,0.33697114573856307,0.16914336580699812,"Buck duty"]
[null,"TAMB",125,"Enter maximum ambient operating temperature",null,null,"Min Boost Duty",null,{"$f":"IF(m_*I2+b_<0,0,m_*I2+b_)","v":0},0.57999999999999996,0.54251700680272097,0.50503401360544209,0.4675510204081631,0.43006802721088422,0.39258503401360523,0.35510204081632635,0.31761904761904736,0.28013605442176848,0.24265306122448949,0.20517006802721061,0.16768707482993161,0.13020408163265274,9.2721088435373744E-2,5.5238095238094864E-2,1.7755102040815984E-2,0,0,0,0,0,0,0,0,0,0,0,0,0,0,0,{"$f":"IF(m_*AO2+b_<0,0,m_*AO2+b_)","v":0},0,0,0,0,0,0,0,0,0,0,0,0,0,0,0,0,0,0,0]
[null,null,null,null,null,null,{"$f":"t_on_min_Boost*I19*10^-6","v":0.11},"Boost duty",{"$f":"IF(I13<D_boost_min,0,I13)","v":0},0.57999999999999996,0.54251700680272097,0.50503401360544209,0.4675510204081631,0.43006802721088422,0.39258503401360523,0.35510204081632635,0.31761904761904736,0.28013605442176848,0.24265306122448949,0.20517006802721061,0.16768707482993161,0.13020408163265274,0,0,0,0,0,0,0,0,0,0,0,0,0,0,0,0,0,0,{"$f":"IF(AO13<D_boost_min,0,AO13)","v":0},0,0,0,0,0,0,0,0,0,0,0,0,0,0,0,0,0,0,{"$f":"IF(BH13<D_boost_min,0,BH13)","v":0},"Boost duty"]
[null,"VREG",5.35,"VREG is fixed at 5.35V",null,null,null,"ton buck",{"$f":"IF(I12>1,1000/fsw,IF(I12*1000/fsw<0.16,0.16,I12*1000/fsw))","v":0.25171217776936161},{"$f":"IF(J12>1,1000/fsw,IF(J12*1000/fsw<0.16,0.16,J12*1000/fsw))","v":0.42000000000000004},0.42000000000000004,0.41710747921135721,0.40863297451064545,0.40187814155231366,0.39640709816860142,0.39189971995013034,0.38807562407104046,0.38484332811696664,0.38211194559079437,0.37978949555900987,0.37780468306310427,0.37535785291257162,0.40762449318002086,0.39219985950362424,0.37789531499286361,0.36459362845552135,0.35219330989507663,0.3406060651297721,0.32975472679031659,0.31957156127025771,0.30999687458487157,0.30097785755290818,0.29246762386442193,0.2844244045825492,0.2768108702682015,0.26959355780763661,0.2627423835966044,0.25623022830956971,0.25003258129436845,0.24412723485780158,{"$f":"IF(AO12>1,1000/fsw,IF(AO12*1000/fsw<0.16,0.16,AO12*1000/fsw))","v":0.23849402047872859},0.23311458040261226,0.22797216921180369,0.2230514808878937,0.21833849763158941,0.21382035731700533,0.20948523695852356,0.20532224998104309,0.20132135542555443,0.19747327750504093,0.19376943416147926,0.19020187347179948,0.18676321691598385,0.18344660865961743,0.18024567012067561,0.17715445918982284,0.17416743355800673,0.17127941766334895,0.16848557286928154,{"$f":"IF(BH12>1,1000/fsw,IF(BH12*1000/fsw<0.16,0.16,BH12*1000/fsw))","v":0.16},"ton buck"]
[null,"Vout sync buck",3.3,"Enter sync buck output voltage, minimum is 0.800V",null,null,null,"toff buck",{"$f":"I15/I12-I15","v":0.24828782223063839},{"$f":"J15/J12-J15","v":7.999999999999996E-2},7.999999999999996E-2,8.2892520788642787E-2,9.1367025489354547E-2,9.8121858447686339E-2,0.10359290183139858,0.10810028004986966,0.11192437592895954,0.11515667188303336,0.11788805440920563,0.12021050444099013,0.12219531693689573,0.12464214708742838,9.2375506819979136E-2,0.10780014049637576,0.12210468500713639,0.13540637154447865,0.14780669010492337,0.1593939348702279,0.17024527320968341,0.18042843872974229,0.19000312541512843,0.19902214244709182,0.20753237613557807,0.2155755954174508,0.2231891297317985,0.23040644219236339,0.2372576164033956,0.24376977169043029,0.24996741870563155,0.25587276514219842,0.26150597952127141,0.26688541959738776,0.27202783078819642,0.27694851911210627,0.28166150236841059,0.28617964268299467,0.29051476304147644,0.29467775001895691,0.2986786445744456,0.30252672249495904,0.30623056583852071,0.30979812652820049,0.31323678308401615,0.31655339134038257,0.31975432987932439,0.32284554081017713,0.32583256644199327,0.32872058233665102,0.33151442713071844,0.78594310120663435,"toff buck"]
[null,"I out ext",0,"Enter VREG external load current",null,null,null,"ton boost",{"$f":"I14/(fsw*10^-3)","v":0},{"$f":"J14/(fsw*10^-3)","v":0.28999999999999998},{"$f":"K14/(fsw*10^-3)","v":0.27125850340136048},0.25251700680272104,0.23377551020408155,0.21503401360544211,0.19629251700680261,0.17755102040816317,0.15880952380952368,0.14006802721088424,0.12132653061224474,0.1025850340136053,8.3843537414965807E-2,6.5102040816326368E-2,0,0,0,0,0,0,0,0,0,0,0,0,0,0,0,0,{"$f":"AM14/(fsw*10^-3)","v":0},0,0,0,0,0,0,0,0,0,0,0,0,0,0,0,0,0,0,0,0,{"$f":"BH14/(fsw*10^-3)","v":0},"ton boost"]
[null,"Iout Sync Buck",0.8,"Enter synchronous buck load current",null,null,null,"toff boost",{"$f":"1/fsw*10^3-I17","v":0.5},{"$f":"1/fsw*10^3-J17","v":0.21000000000000002},0.22874149659863952,0.24748299319727896,0.26622448979591845,0.28496598639455789,0.30370748299319739,0.32244897959183683,0.34119047619047632,0.35993197278911576,0.37867346938775526,0.3974149659863947,0.41615646258503419,0.43489795918367363,0.5,0.5,0.5,0.5,0.5,0.5,0.5,0.5,0.5,0.5,0.5,0.5,0.5,0.5,0.5,0.5,{"$f":"1/fsw*10^3-AM17","v":0.5},0.5,0.5,0.5,0.5,0.5,0.5,0.5,0.5,0.5,0.5,0.5,0.5,0.5,0.5,0.5,0.5,0.5,0.5,0.5,0.5,{"$f":"1/fsw*10^3-BH17","v":0.5},"toff boost"]
[null,"Iout 3V3",0,null,null,null,null,"fsw",{"$f":"1/(I15+I16)*10^3","v":2000},{"$f":"1/(J15+J16)*10^3","v":2000},2000,2000,2000,2000,2000,2000,2000,2000,2000,2000,2000,2000,2000,2000,2000,2000,2000,2000,2000,2000,2000,2000,2000,2000,2000,2000,2000,2000,{"$f":"1/(AM15+AM16)*10^3","v":2000},2000,2000,2000,1999.9999999999995,2000,2000,2000,2000,2000,2000,2000,2000,2000,2000,2000,2000,2000,2000,2000,2000,{"$f":"1/(BH15+BH16)*10^3","v":1057.1460362937382},"fsw"]
[null,"Iout V5A",0,null,null,null,null,"V out buck",null,null,null,null,null,null,null,null,null,null,null,null,null,null,null,null,null,null,null,null,null,null,null,null,null,null,null,null,null,null,null,null,null,null,null,null,null,null,null,null,null,null,null,null,null,null,null,null,null,null,null,null,"V out buck",null,null,"buck",null,0.54]
[null,"RFB1 =",{"$f":"(Vout_sync_buck-VFB_adj)/VFB_adj*RFB2_adj","v":4.75},"Calculated value of the ADJ feedback resistor (in KΩ) from VOUT,ADJ to VFB2",null,null,null,"VREG",{"$f":"IF(I14>0,IF(I12/(1-I14)*I9>Vreg,Vreg,I12/(1-I14)*I9),IF(I12*(I9+I11)>Vreg,Vreg,I12*(I9+I11)))","v":5.35},5.35,5.35,5.35,5.35,5.35,5.35,5.35,5.35,5.35,5.35,5.35,5.35,5.35,5.35,5.35,5.35,5.35,5.35,5.35,5.35,5.35,5.35,5.35,5.35,5.35,5.35,5.35,5.35,5.35,5.35,5.35,{"$f":"IF(AO14>0,IF(AO12/(1-AO14)*AO9>Vreg,Vreg,AO12/(1-AO14)*AO9),IF(AO12*(AO9+AO11)>Vreg,Vreg,AO12*(AO9+AO11)))","v":5.35},5.35,5.35,5.35,5.35,5.35,5.35,5.35,5.35,5.35,5.35,5.35,5.35,5.35,5.35,5.35,5.35,5.35,5.35,5.35,"VREG",null,null,"Boost duty",0.54,0]
[null,"RFB2 =",1.52,"Enter the value of the ADJ feedback resistor (in KΩ) from VFB2 to ground",null,null,"Circuit Currents","Ilpk",{"$f":"IF(I14=0,Iout_PreReg+I23/2,IF(I$12>I$14,(Iout_PreReg+I23/2*(1-I12))/(1-I14),Iout_PreReg/(1-I14)+I23/2))","v":0.77732445278026807},1.6074969144650282,1.4769310569102923,1.3665220672977834,1.2727391765788088,1.1905880887644531,1.1179556151546695,1.0532176472568568,0.99510996443247657,0.94260451710978421,0.894881532085127,0.85127847591992756,0.81125051087388877,0.77442000190285887,0.70718427873709966,0.71413264481968275,0.72057482952703866,0.72656391302190604,0.7321458426778501,0.73736058608829735,0.74224306858479039,0.74682394058085189,0.75113020954450804,0.75518576353993649,0.75901180734907259,0.76262722767626523,0.76604890048612861,0.76929195086053903,0.77236997369088922,0.77529522190304201,0.77807876763862771,0.78073064080792287,{"$f":"IF(AO14=0,Iout_PreReg+AO23/2,IF(AO$12>AO$14,(Iout_PreReg+AO23/2*(1-AO12))/(1-AO14),Iout_PreReg/(1-AO14)+AO23/2))","v":0.78325994862667692},0.78567497910653783,0.78798329095153274,0.79019179189480404,0.79230680716993018,0.79433413953373999,0.79627912203007289,0.79814666449667471,0.79994129466262842,0.80166719455525604,0.80332823282844368,0.80492799353490174,0.80646980178985839,0.80795674671055162,0.8093917019625867,0.81077734419908665,0.81211616964022693,0.81341050905280499,0.81466254124481208,1.018832776814613,"Ilpk","Circuit Currents",null,"Ipk",1.734,0.9]
[null,"Iout V5SNR",0,"Enter V5SNR typical load current",null,null,null,"ΔIL",{"$f":"IF(I$12>I$14,IF(I14=0,I9*I12/(L_buck*10^-6*I19*10^3),(I9*(I14)/(L_buck*10^-6*I19*10^3))),I9*(I12)/(L_buck*10^-6*I19*10^3))","v":0.22357139049707117},0.12012433145871107,0.12665103878120701,0.13081017812231885,0.13276035015109758,0.13264588395650104,0.1305515547399505,0.1265413348290107,0.12066475762677244,0.11296131639301986,0.10346282660613454,9.2195400042267756E-2,7.9180842888202582E-2,6.4573656552921882E-2,8.3291042259246023E-2,9.7187774437097474E-2,0.11007214386816382,0.12205031087465151,0.13321417020160867,0.1436436570347891,0.15340862203694064,0.16257036603533068,0.17118290396661923,0.17929401196001774,0.18694609958039224,0.19417694023749507,0.2010202858616095,0.20750638661750129,0.2136624322889,0.21951292872838868,0.22508002021999002,0.23038376658491896,{"$f":"IF(AO$12>AO$14,IF(AO14=0,AO9*AO12/(L_buck*10^-6*AO19*10^3),(AO9*(AO14)/(L_buck*10^-6*AO19*10^3))),AO9*(AO12)/(L_buck*10^-6*AO19*10^3))","v":0.23544238225523756},0.24027244325470853,0.24488906699176327,0.24930606893297788,0.2535360995457247,0.2575907643438064,0.26148072941498329,0.26521581443477427,0.26880507486132221,0.27225687474920612,0.27557895140609617,0.27877847293727948,0.28186208957305248,0.28483597954770895,0.2877058901922584,0.29047717481273161,0.29315482584925268,0.29574350473171906,0.29824756882813891,0.70658803851267182,"ΔIL",null,null,"DI",0.17799999999999999,0.252]
[null,"Iout V5CAN",0,"Enter V5CAN typical load current",null,null,null,"IL RMS",{"$f":"IF(I12>I14,SQRT((I22-I23/2)^2+I23^2/12+(I12-I14)*I23^2/12),SQRT((I22-I23/2)^2+I23^2/12+(I14-I12)*I23^2/12))","v":0.67022691846702753},1.547924234699656,1.4142188552276298,1.3018451236020614,1.2071803797450247,1.1251605586452826,1.0536240311475664,0.99090941358132378,0.93572368695857211,0.88701714430532153,0.84395464009863563,0.80586420721311924,0.77219746882736751,0.74251245268151833,0.66632669406685652,0.66659311282861367,0.66686923989126712,0.6671494403383178,0.66742965452109926,0.66770698069243195,0.66797937156760656,0.66824541216292299,0.66850415611587755,0.6687550044186934,0.66899761513739175,0.66923183592061064,0.6694576533740777,0.66967515498717534,0.66988450044915393,0.67008590002163626,0.67027959823552608,0.67046586161975674,{"$f":"IF(AO12>AO14,SQRT((AO22-AO23/2)^2+AO23^2/12+(AO12-AO14)*AO23^2/12),SQRT((AO22-AO23/2)^2+AO23^2/12+(AO14-AO12)*AO23^2/12))","v":0.67064496949226682},0.67081720708242687,0.67098286043177446,0.6711422126527371,0.67129554122481716,0.67144311608306984,0.67158519831082064,0.67172203929206031,0.67185388021218884,0.67198095182124329,0.67210347439334794,0.672221657831228,0.67233570187630798,0.67244579639397228,0.67255212171058232,0.67265484898430661,0.67275414059606875,0.67285015060055497,0.67294302514859128,0.70113101204265127,"IL RMS",null,null,"IC rms",{"$f":"SQRT(((BM22-BM23/2-Iout_PreReg)^2+BM23^2/12)*(1-BM21)+Iout_PreReg^2*BM21)","v":0.82565218794399264},{"$f":"SQRT(((BN22-BN23/2-Iout_PreReg)^2+BN23^2/12)*(1-BN21)+Iout_PreReg^2*BN21)","v":0.13059801342985289}]
[null,"Iout V5P",7.4999999999999997E-2,"Enter V5P typical load current",null,null,null,"Isw buck RMS",{"$f":"IF(I12>I14,SQRT(I12*(I22-I23/2)^2+I14*I23^2/12),SQRT(I12*(I22-I23/2)^2+I12*I23^2/12))","v":0.47221574436264263},1.4184932345032759,1.2958707125123883,1.1886829474547753,1.0908966637176347,1.0082440766490357,0.93760472768427561,0.87669458509569886,0.82376782395661952,0.77760386543483673,0.73722781032770479,0.7018494169374967,0.67083696260302694,0.64304794700701962,0.60092252774068289,0.5894433417735776,0.57859423664777221,0.56831993077047294,0.55857166408419057,0.54930624694116204,0.54048527216807307,0.5320744584429048,0.52404310003256638,0.51636360322146935,0.5090110938188126,0.50196308327236938,0.49519918336343749,0.48870086137701813,0.48245122915648558,0.4764348606553841,0.47063763356024474,0.4650465913304096,{"$f":"IF(AO12>AO14,SQRT(AO12*(AO22-AO23/2)^2+AO14*AO23^2/12),SQRT(AO12*(AO22-AO23/2)^2+AO12*AO23^2/12))","v":0.45964982262429471},0.45443635558747775,0.44939606489058592,0.44451958974298145,0.43979826138638312,0.43522403880243032,0.43078945155891207,0.42648754887826323,0.4223118541447744,0.41825632417842784,0.41431531269715077,0.41048353746858135,0.40675605071966664,0.4031282124295712,0.39959566618011338,0.39615431727963335,0.39280031291194861,0.38953002410740617,0.38634002932236061,0.27371641036718197,"Isw buck RMS",null,null,null,null,{"$f":"SQRT(BN20/3*BN23^2)","v":0.10691454531540599}]
[null,"Rth,j-a",30,"Enter junction to ambient thermal resistance",null,null,null,"I buck Diode avg",{"$f":"IF(I$12>I$14,(I22-I23/2)*(1-I12),I22*(I14-I12)+(I22-I23/2)*(1-I14))","v":0.3304903374352775},0.2475895597977075,0.22617688600315008,0.21570573233387086,0.2204428672793213,0.22062997118124614,0.21810031819104481,0.21402709151096172,0.20924879580559244,0.20408614893720653,0.19879465415621531,0.19358237447396362,0.18858649839085237,0.18500214437120305,0.1229589600846598,0.14349034315037124,0.16253080071185777,0.18023637657349678,0.19674216178801224,0.21216568275573777,0.22660965522702284,0.24016423788251645,0.25290888804305828,0.26491389882230487,0.27624167953302808,0.28694782786770462,0.29708203220311036,0.30668883453726697,0.31580827847909115,0.32447646195275504,0.33272601053597101,0.34058648438956945,{"$f":"IF(AO$12>AO$14,(AO22-AO23/2)*(1-AO12),AO22*(AO14-AO12)+(AO22-AO23/2)*(1-AO14))","v":0.34808472937832224},0.35524518109631198,0.36209012899226461,0.36863994656296639,0.37491329258572653,0.38092728754698946,0.38669766875697681,0.39223892709094627,0.39756442784361001,0.4026865178064627,0.40761662036395135,0.41236532014207022,0.41694243852291701,0.42135710115354813,0.42561779842110542,0.42973243973375785,0.43370840233451502,0.43755257533148684,0.44127139940806831,0.5529672920298625,"I buck Diode avg"]
[null,"Iout_PreReg",{"$f":"I_reg_ext+Vout_sync_buck*Iout_sync_buck/(0.85*Vreg)+Iout_3V3+Iout_V5A+Iout_V5B+Iout_V5CAN+Iout_V5P+Icc","v":0.66553875755909842},"Total VREG current",null,null,null,"I boost SW RMS",{"$f":"IF(I12>I14,SQRT(I14*(I22-I23/2)^2+I14*I23^2/12),SQRT(I14*(I22-I23/2)^2+I12*I23^2/12))","v":0},1.1787870621604906,1.0415500010748138,0.9250378119059971,0.82529672342951432,0.73771578604011767,0.65999601988916989,0.59031523621207738,0.52718478968197613,0.46932403968328973,0.41559479557902829,0.36491147320909612,0.3161304131469081,0.26787433206791067,0,0,0,0,0,0,0,0,0,0,0,0,0,0,0,0,0,0,{"$f":"IF(AO12>AO14,SQRT(AO14*(AO22-AO23/2)^2+AO14*AO23^2/12),SQRT(AO14*(AO22-AO23/2)^2+AO12*AO23^2/12))","v":0},0,0,0,0,0,0,0,0,0,0,0,0,0,0,0,0,0,0,0,"I boost SW RMS"]
[null,null,null,null,null,null,null,"I boost Diode avg",{"$f":"IF(I$12>I$14,I22*(1-I14)+I23/2*(I12-1),(I22-I23/2)*(1-I14))","v":0.72181439912067458},0.66553875755861502,0.66553875755884473,0.66553875756060743,0.66553875755971048,0.66553875755949954,0.66553875755936043,0.66553875755927683,0.66553875755921355,0.66553875755916636,0.6655387575591355,0.66553875755911596,0.6655387575591043,0.66553875755909764,0.6994902264948375,0.70365578908083359,0.7071345050719563,0.71003752328049385,0.71245589710527646,0.71446465837437279,0.71612597581339033,0.71749162325337446,0.71860492277321264,0.71950228515171921,0.72021443909387539,0.72076741816822842,0.72118335782623866,0.72148114258780749,0.72167693429107294,0.72178460538382505,0.72181609598202545,0.72178170940796482,{"$f":"IF(AO$12>AO$14,AO22*(1-AO14)+AO23/2*(AO12-1),(AO22-AO23/2)*(1-AO14))","v":0.72169035783419944},0.72154976727081543,0.72136664927401806,0.72114684529815509,0.72089544846725451,0.72061690663539002,0.72031510988416658,0.71999346502959027,0.71965495924831635,0.71930221456065813,0.7189375346061686,0.71856294490253991,0.71818022757865663,0.71779095140896454,0.71739649784182657,0.71699808360365791,0.71659678036890928,0.71619353195511215,0.71578916932162207,0.72529609709477616,"I boost Diode avg"]
[null,"A4413 Operating at Vin nom",null,null,null,null,null,"I Cout RMS",{"$f":"SQRT(((I22-I23/2-Iout_PreReg)^2+I23^2/12)*(1-I14)+Iout_PreReg^2*I14)","v":6.4539501243291483E-2},0.76423971196438356,0.70492855760503192,0.65142366067054425,0.60300424065347247,0.55790815548156214,0.51555147648136046,0.47541519408271182,0.43701282030362593,0.39984551534137269,0.36338394741133356,0.32701759867247399,0.28997201002873663,0.25115315522159459,2.4044052834730094E-2,2.8055693866599427E-2,3.1775090946281795E-2,3.5232889919078782E-2,3.8455618512885696E-2,4.1466352028208878E-2,4.4285254614518613E-2,4.6930022296377077E-2,4.941624784289473E-2,5.1757723034602111E-2,5.3966690458345019E-2,5.6054054358267824E-2,5.8029558077387883E-2,5.9901934086090465E-2,6.16790313988533E-2,6.3367924245969168E-2,6.4975005131608823E-2,6.6506064827361433E-2,{"$f":"SQRT(((AO22-AO23/2-Iout_PreReg)^2+AO23^2/12)*(1-AO14)+Iout_PreReg^2*AO14)","v":6.7966361386854093E-2},6.9360679895977523E-2,7.069338437464541E-2,7.1968463004531094E-2,7.3189567661005955E-2,7.4360048567329043E-2,7.5482984757820157E-2,7.6561210928631371E-2,7.7597341165360947E-2,7.8593789962590185E-2,7.9552790888652219E-2,8.0476413197305544E-2,8.1366576644676128E-2,8.2225064733380246E-2,8.3053536574970652E-2,8.3853537535786296E-2,8.4626508809151957E-2,8.5373796033970689E-2,8.6096657074038727E-2,0.20397439712073034]
[null,"Pdiss Total",{"$f":"IF(Topology=\"Buck\",I88,I3)","v":0.49594354017553727},"A4413 Power dissipation at nominal input voltage",null,null,"BUCK FET","Rds_On Buck",{"$f":"IF(I2>7,Buck_RdsON_factor_7V*(I4-150)+Rds_ON_150_7V,Buck_RdsON_factor_6V*(I4-150)+Rds_ON_150_6V)","v":0.25710995323475083},0.28456403930158158,0.28229316345700389,0.28052041127807104,0.27907024853400175,0.27797336663541494,0.27713185265449747,0.27648031629136222,0.27597326375148684,0.27557966809706341,0.27527661866613173,0.27504689773434327,0.27487751933505428,0.25560908517087405,0.25540895538999858,0.25545106553245206,0.25550417919384616,0.25556765485690819,0.25564093780577218,0.25572354598372171,0.25581505851760045,0.25591510634251036,0.25602336449327923,0.25613954572812775,0.25626339522430963,0.25639468614182681,0.25653321589433892,0.25667880299948848,0.2568312844065152,0.25699051321904987,0.25715635674669735,0.25732869483143955,{"$f":"IF(AO2>7,Buck_RdsON_factor_7V*(AO4-150)+Rds_ON_150_7V,Buck_RdsON_factor_6V*(AO4-150)+Rds_ON_150_6V)","v":0.25750741840475955},0.25769242823928012,0.25788363386504859,0.25808095262571951,0.25828430885404247,0.25849363314944968,0.2587088617433117,0.25892993593971281,0.25915680162147964,0.25938940881276162,0.25962771129075907,0.25987166624028302,0.26012123394573938,0.26037637751589632,0.26063706263743847,0.26090325735386038,0.26117493186671148,0.26145205835620211,0.26173461081957033,0.27143573050835318,"Rds_On Buck","BUCK FET"]
[null,"Tj estimate",{"$f":"IF(Reset=1,150,Ta+Rth_ja*Pdiss_total)","v":139.87830620526611},"Estimated A4413 junction temperature at nominal input voltage",null,null,null,"Conduction Losses",{"$f":"I25^2*I30","v":5.7332359490497767E-2},0.57257786448155401,0.47404951859532146,0.39636612591971621,0.33210909278039141,0.28257552652149243,0.2436273392438571,0.2125009450972784,0.18727364302647317,0.16663414378976363,0.14961417577323224,0.13548606759234808,0.12370099433645605,0.10569708206054923,9.2230187523968596E-2,8.8754800322303803E-2,8.5535463843373544E-2,8.2545169094201939E-2,7.9760561571103297E-2,7.7161345846639445E-2,7.4729802427702705E-2,7.2450393039206737E-2,7.0309436081583007E-2,6.8294838176126388E-2,6.6395870842237484E-2,6.460298372210567E-2,6.2907647579499862E-2,6.1302221692948078E-2,5.9779841343623887E-2,5.8334321940981031E-2,5.6960076990986069E-2,5.5652047634732443E-2,{"$f":"AO25^2*AO30","v":5.4405641900845382E-2},5.3216682147272099E-2,5.2081359434963309E-2,5.0996193791510935E-2,4.9957999497737618E-2,4.8963854672860858E-2,4.8011074550654544E-2,4.7097187935096554E-2,4.6219916403323902E-2,4.5377155889487104E-2,4.4566960337833431E-2,4.3787527159064643E-2,4.3037184262332044E-2,4.2314378467456497E-2,4.1617665129146546E-2,4.0945698827997389E-2,4.0297225002584112E-2,3.9671072416506199E-2,3.9066146360911005E-2,2.0336147688529142E-2,"Conduction Losses"]
[null,"T rise",{"$f":"Tj-Ta","v":14.878306205266114},"A4413 temperature rise at nominal input voltage",null,null,null,"Switching Losses",{"$f":"0.5*I2*Iout_PreReg*I19*10^3*(I2/SLEW_rate+I2/1.5)*10^-9","v":0.17037792193512921},1.4493955164620365E-2,1.7048436378556766E-2,1.9810134250406886E-2,2.2779048780170733E-2,2.5955179967848296E-2,2.9338527813439583E-2,3.2929092316944596E-2,3.6726873478363321E-2,4.0731871297695788E-2,4.4944085774941966E-2,4.9363516910101858E-2,5.399016470317549E-2,5.8824029154162828E-2,6.3865110263063907E-2,6.911340802987867E-2,7.4568922454607209E-2,8.0231653537249412E-2,8.6101601277805362E-2,9.2178765676275046E-2,9.8463146732658449E-2,0.10495474444695557,0.1116535588191664,0.11855958984929099,0.12567283753732925,0.13299330188328126,0.14052098288714698,0.14825588054892641,0.1561979948686196,0.16434732584622652,0.17270387348174715,0.18126763777518146,{"$f":"0.5*AO2*Iout_PreReg*AO19*10^3*(AO2/SLEW_rate+AO2/1.5)*10^-9","v":0.19003861872652955},0.19901681633579132,0.2082022306029668,0.21759486152805602,0.22719470911105899,0.2370017733519757,0.24701605425080611,0.2572375518075502,0.26766626602220805,0.27830219689477964,0.28914534442526485,0.30019570861366385,0.31145328945997663,0.32291808696420304,0.3345901011263433,0.34646933194639717,0.35855577942436478,0.37084944356024613,0.38335032435404121,0.81051455180558618,"Switching Losses"]
[null,null,null,null,null,null,null,"Total Buck FET Losses",{"$f":"I31+I32","v":0.22771028142562699},{"$f":"J31+J32","v":0.58707181964617439},{"$f":"IF(K15=1/fsw*10^3,K30*K25^2,K31+K32)","v":0.4910979549738782},0.4161762601701231,0.35488814156056214,0.30853070648934072,0.2729658670572967,0.24543003741422301,0.22400051650483649,0.20736601508745942,0.19455826154817421,0.18484958450244993,0.17769115903963154,0.16452111121471205,0.15609529778703252,0.15786820835218246,0.16010438629798074,0.16277682263145135,0.16586216284890865,0.1693401115229145,0.17319294916036115,0.17740513748616232,0.18196299490074941,0.18685442802541738,0.19206870837956674,0.19759628560538695,0.20342863046664683,0.20955810224187449,0.21597783621224348,0.22268164778720756,0.22966395047273322,0.2369196854099139,0.24444426062737493,0.25223349848306342,{"$f":"IF(AQ15=1/fsw*10^3,AQ30*AQ25^2,AQ31+AQ32)","v":0.26028359003793011},0.26859105531956695,0.27715270860879659,0.28596562802483655,0.29502712880146065,0.30433473974264674,0.31388618242553196,0.32367935278426674,0.33371230476309827,0.34398323577272849,0.35449047372230869,0.36523246543165955,0.37620776625548985,0.38741503077439454,0.39885300442694888,0.41052051597675232,0.4224164707149522,0.83085069949411527,"Total Buck FET Losses"]
[null,"Tj (MAX):",{"$f":"IF(Topology=\"Buck\",MAX(J89:BH89),MAX(J4:BH4))","v":158.25603389803487},"Maximum junction temperature at worse case input voltage",null,null,"3V3 LDO","Output voltage",{"$f":"IF(I21-Iout_3V3*I35>3.3,3.3,I21-Iout_3V3*I35)","v":3.3},3.3,3.3,3.3,3.3,3.3,3.3,3.3,3.3,3.3,3.3,3.3,3.3,3.3,3.3,3.3,3.3,3.3,3.3,3.3,3.3,3.3,3.3,3.3,3.3,3.3,3.3,3.3,3.3,3.3,3.3,3.3,{"$f":"IF(AO21-Iout_3V3*AO35>3.3,3.3,AO21-Iout_3V3*AO35)","v":3.3},3.3,3.3,3.3,3.3,3.3,3.3,3.3,3.3,3.3,3.3,3.3,3.3,3.3,3.3,3.3,3.3,3.3,3.3,3.3,"Output voltage","5V0 LDO"]
[null,null,{"$f":"IF(Topology=\"Buck\",HLOOKUP(C34,J89:BH90,2,FALSE),HLOOKUP(C34,J4:BH5,2,FALSE))","v":36},null,null,null,null,"Series pass resistance",{"$f":"(Rds_ON_3V3_150-Rds_ON_3V3_min40)/190*(I4-150)+Rds_ON_3V3_150","v":0.49364009684350135},0.50376575289409831,0.50106151732739779,0.49895046422660294,0.49722356150782171,0.49591735753823396,0.49491525430017874,0.49413938281852288,0.4935355675479563,0.49306686056420279,0.49270597907807911,0.49243241964256823,0.49223071813049224,0.49185962834356278,0.49162221588918087,0.49167217083456943,0.49173517917174753,0.49181047987359783,0.49189741488485922,0.49199541234527322,0.49210397297617892,0.49222265895866252,0.49235108478898348,0.49248890971437859,0.49263583144053985,0.49279158086888303,0.49295591767275576,0.49312862656100176,0.49330951410772994,0.49349840605088202,0.49369514498083988,0.49389958835505005,{"$f":"(Rds_ON_3V3_150-Rds_ON_3V3_min40)/190*(AO4-150)+Rds_ON_3V3_150","v":0.49411160678635085},0.49433108256205088,0.49455790835832536,0.49479198612057318,0.49503322608530409,0.49528154592314627,0.49553686998585406,0.49579912864290393,0.49606825769550006,0.49634419785766665,0.49662689429564383,0.49691629621809502,0.49721235651070944,0.49751503140969611,0.49782428020942715,0.49814006500014024,0.49846235043215759,0.49879110350307176,0.49912629336600201,0.51063465871518277,"Series pass resistance"]
[null,null,null,null,null,null,null,"Power dissipated",{"$f":"(I21-I34)*Iout_3V3","v":0},0,0,0,0,0,0,0,0,0,0,0,0,0,0,0,0,0,0,0,0,0,0,0,0,0,0,0,0,0,0,0,{"$f":"(AO21-AO34)*Iout_3V3","v":0},0,0,0,0,0,0,0,0,0,0,0,0,0,0,0,0,0,0,0,"Power dissipated"]
[null,"Inductor Calculation, Pre-Regulator",null,null,null,null,"Adj BUCK","V1",{"$f":"IF(Reset=1,Vreg-Vout_sync_buck,Vreg-Iout_sync_buck*(I49+DCR2*10^-3)-Vout_sync_buck)","v":1.8163120374113078},1.8094835992550662,1.8113072544579829,1.8127308852237665,1.8138954565249126,1.8147763212292221,1.8154521095394216,1.8159753339514388,1.8163825288252555,1.8166986107305663,1.8169419783604042,1.8171264586233198,1.8172624800619994,1.8175127318628732,1.8176728356879304,1.8176391475760703,1.8175966566483721,1.8175458761186212,1.8174872497596004,1.8174211632168253,1.8173479531889729,1.8172679149281059,1.8171813084064885,1.817088363417648,1.8169892838198649,1.8168842510851997,1.8167734272827705,1.8166569575984948,1.816534972472998,1.8164075894233855,1.8162749146019745,1.8161370441351732,{"$f":"IF(Reset=1,Vreg-Vout_sync_buck,Vreg-Iout_sync_buck*(AO49+DDX2*10^-3)-Vout_sync_buck)","v":1.8159940652777866},1.8158460574117026,1.815693092912869,1.8155352379063459,1.8153725529259148,1.8152050934920121,1.8150329106195242,1.8148560512651652,1.8146745587226567,1.8144884729726636,1.8142978309934099,1.814102667037031,1.8139030128759881,1.8136988980232545,1.813490349929471,1.8132773941598286,1.8130600545530795,1.8128383533622578,1.8126123113831429,1.8048514155917088]
[null,"Ripple Current",0.35,"Select desired inductor ripple current, 20% to 45%",null,null,null,"V3",{"$f":"IF(Reset=1,Vout_sync_buck,Vout_sync_buck+Iout_sync_buck*(I53+dcr_2*10^-3))","v":3.4576879625886918},3.4645164007449329,3.4626927455420167,3.4612691147762331,3.4601045434750874,3.459223678770778,3.458547890460578,3.4580246660485607,3.4576174711747445,3.4573013892694333,3.4570580216395959,3.4568735413766793,3.4567375199380002,3.4564872681371264,3.4563271643120692,3.4563608524239293,3.4564033433516279,3.4564541238813788,3.4565127502403992,3.4565788367831742,3.4566520468110267,3.4567320850718932,3.4568186915935111,3.4569116365823516,3.4570107161801351,3.4571157489147999,3.4572265727172291,3.4573430424015053,3.4574650275270016,3.4575924105766136,3.4577250853980255,3.4578629558648264,{"$f":"IF(Reset=1,Vout_sync_buck,Vout_sync_buck+Iout_sync_buck*(AO53+dcr_2*10^-3))","v":3.4580059347222134},3.4581539425882966,3.4583069070871302,3.4584647620936542,3.4586274470740852,3.4587949065079875,3.4589670893804758,3.4591439487348343,3.4593254412773424,3.4595115270273356,3.4597021690065901,3.459897332962969,3.4600969871240115,3.4603011019767447,3.460509650070529,3.460722605840171,3.4609399454469201,3.4611616466377422,3.4613876886168566,3.4691485844082903]
[null,"L calculated",{"$f":"ROUNDUP((Vin_nom-Vreg)*Vreg/(Vin_nom*fsw*10^-3*k_ripple*Iout_PreReg),2)","v":6.37},"Recommended minimum inductor value",null,null,null,"Required Buck duty",{"$f":"IF(Reset=1,Vout_sync_buck/Vreg,I38/(I37+I38))","v":0.65561015597055217},0.6569048920638858,0.65655910988661681,0.65628917610470872,0.6560683624336533,0.65590134220151275,0.65577320638236225,0.65567399811311367,0.6555967901355223,0.65553685803364314,0.65549071324224417,0.65545573404942736,0.65542994310542302,0.65538249301045259,0.65535213581950513,0.65535852340233791,0.65536658008184068,0.65537620854785339,0.65538732465688276,0.65539985528691214,0.65541373659670599,0.65542891260369618,0.65544533401469696,0.65546295725869397,0.65548174368224021,0.65550165887652645,0.65552267211172344,0.65554475585921601,0.65556788538623478,0.65559203841043123,0.6556171948043279,0.65564333634145378,{"$f":"IF(Reset=1,Vout_sync_buck/Vreg,AO38/(AO37+AO38))","v":0.65567044647747696},0.65569851016084513,0.65572751366839799,0.65575744446220219,0.65578829106448333,0.65582004294804475,0.65585269043998407,0.65588622463686663,0.65592063732979577,0.65595592093806143,0.6559920684502446,0.65602907337181815,0.65606692967842473,0.65610563177412684,0.6561451744540252,0.65618555287071889,0.65622676250415635,0.65626879913495295,0.65631165882003362,0.65778319765041537]
[null,"Irms",{"$f":"IF(Topology=\"buck\",MAX(J104:BG104),MAX(J24:BG24))","v":1.547924234699656},"Maximum RMS inductor current, must be less than inductor DC rating",null,null,null,"ton buck",{"$f":"I39/(fsw*10^3)*10^6","v":0.32780507798527608},0.3284524460319429,0.3282795549433084,0.32814458805235436,0.32803418121682665,0.32795067110075637,0.32788660319118113,0.32783699905655683,0.32779839506776115,0.32776842901682157,0.32774535662112209,0.32772786702471368,0.32771497155271151,0.3276912465052263,0.32767606790975257,0.32767926170116896,0.32768329004092034,0.32768810427392669,0.32769366232844138,0.32769992764345607,0.32770686829835299,0.32771445630184809,0.32772266700734848,0.32773147862934698,0.32774087184112011,0.32775082943826322,0.32776133605586172,0.32777237792960801,0.32778394269311739,0.32779601920521562,0.32780859740216395,0.32782166817072689,{"$f":"AO39/(fsw*10^3)*10^6","v":0.32783522323873848},0.32784925508042256,0.32786375683419899,0.32787872223110109,0.32789414553224167,0.32791002147402237,0.32792634521999203,0.32794311231843332,0.32796031866489789,0.32797796046903072,0.3279960342251223,0.32801453668590907,0.32803346483921236,0.32805281588706342,0.3280725872270126,0.32809277643535945,0.32811338125207817,0.32813439956747648,0.32815582941001681,0.32889159882520769]
[null,"Ipk",{"$f":"IF(Topology=\"buck\",MAX(J102:BG102),MAX(J22:BG22))","v":1.6074969144650282},"Maximum peak inductor current, must be less than inductor saturation current",null,null,null,"toff buck",{"$f":"1/(fsw*10^-3)-I40","v":0.17219492201472392},0.1715475539680571,0.1717204450566916,0.17185541194764564,0.17196581878317335,0.17204932889924363,0.17211339680881887,0.17216300094344317,0.17220160493223885,0.17223157098317843,0.17225464337887791,0.17227213297528632,0.17228502844728849,0.1723087534947737,0.17232393209024743,0.17232073829883104,0.17231670995907966,0.17231189572607331,0.17230633767155862,0.17230007235654393,0.17229313170164701,0.17228554369815191,0.17227733299265152,0.17226852137065302,0.17225912815887989,0.17224917056173678,0.17223866394413828,0.17222762207039199,0.17221605730688261,0.17220398079478438,0.17219140259783605,0.17217833182927311,{"$f":"1/(fsw*10^-3)-AO40","v":0.17216477676126152},0.17215074491957744,0.17213624316580101,0.17212127776889891,0.17210585446775833,0.17208997852597763,0.17207365478000797,0.17205688768156668,0.17203968133510211,0.17202203953096928,0.1720039657748777,0.17198546331409093,0.17196653516078764,0.17194718411293658,0.1719274127729874,0.17190722356464055,0.17188661874792183,0.17186560043252352,0.17184417058998319,0.17110840117479231]
[null,"DCR <",{"$f":"ROUNDDOWN(0.033*Vreg*Iout_PreReg/C40^2*1000,0)","v":49},"Recommended inductor DC resistance",null,null,null,"VREG_actual",{"$f":"I37*I39/(1-I39)-Iout_sync_buck*(I53+dcr_2*10^-3)","v":3.3000000000000003},3.3000000000000007,3.3000000000000003,3.3000000000000012,3.3,3.3000000000000007,3.3000000000000003,3.3000000000000012,3.3000000000000007,3.3000000000000007,3.3,3.3,3.3000000000000012,3.3000000000000012,3.3000000000000016,3.3000000000000016,3.2999999999999989,3.2999999999999994,3.3000000000000003,3.3000000000000003,3.3000000000000012,3.2999999999999989,3.3000000000000012,3.3,3.2999999999999994,3.3000000000000012,3.3,3.2999999999999994,3.3000000000000007,3.3000000000000007,3.2999999999999994,3.3000000000000012,{"$f":"AO37*AO39/(1-AO39)-Iout_sync_buck*(AO53+dcr_2*10^-3)","v":3.3},3.3,3.3000000000000007,3.3000000000000007,3.3,3.3000000000000007,3.3,3.3,3.3,3.2999999999999994,3.2999999999999994,3.3,3.3000000000000003,3.2999999999999989,3.2999999999999994,3.3000000000000003,3.3000000000000007,3.2999999999999989,3.3000000000000012,3.2999999999999989]
[null,"Lout = ",6.8,"Enter selected inductor value at total VREG current",null,null,null,"Ilpk",{"$f":"Iout_sync_buck+I44/2","v":0.86334003288011685},0.86322652278868894,0.86325692971794132,0.86328062017307516,0.86329996924593111,0.86331458643147574,0.86332578994256759,0.86333445785618301,0.86334119976395118,0.86334643081255713,0.86335045709133684,0.86335350834033009,0.86335575765501815,0.8633598949619895,0.86336254122499612,0.86336198445624679,0.86336128216942665,0.86336044282494961,0.86335947373311417,0.86335838124150666,0.86335717088703612,0.86335584752011929,0.86335441540676783,0.86335287831301866,0.8633512395751598,0.86334950215845319,0.86334766870649027,0.86334574158287358,0.86334372290657713,0.86334161458207426,0.86333941832511296,0.86333713568485348,{"$f":"Iout_sync_buck+AO44/2","v":0.86333476806295129},0.86333231673006705,0.86332978284019657,0.86332716744315063,0.8633244714954561,0.86332169586990659,0.86331884136395287,0.86331590870709518,0.86331289856741222,0.8633098115573421,0.86330664823881365,0.86330340912781167,0.86330009469844649,0.86329670538659098,0.86329324159313692,0.86328970368691593,0.86328609200732531,0.86328240686692426,0.86327864855363623,0.86314898592823475]
[null,"Lout DCR",139,"Enter selected inductor DC resistance",null,null,null,"ΔIL",{"$f":"I37*I39/(L_buck2*10^-6*fsw*10^3)","v":0.12668006575940627},0.1264530455808533,0.12651385943809629,0.12656124033649627,0.12659993848810036,0.12662917286061387,0.12665157988364786,0.12666891571135497,0.12668239952724258,0.12669286162472337,0.12670091418247187,0.12670701668059409,0.1267115153100698,0.12671978992409874,0.12672508245629591,0.12672396891848273,0.12672256434423734,0.12672088565451153,0.12671894746999363,0.12671676248592328,0.12671434177616597,0.12671169504158666,0.12670883081422923,0.12670575662617997,0.1267024791500202,0.12669900431627487,0.12669533741212505,0.12669148316477141,0.12668744581215591,0.12668322916321861,0.12667883664944857,0.1266742713691586,{"$f":"AO37*AO39/(L_buck2*10^-6*fsw*10^3)","v":0.12666953612565263},0.12666463346024445,0.12665956568091905,0.12665433488729166,0.12664894299241,0.12664339174185543,0.12663768273052448,0.12663181741741286,0.1266257971386735,0.12661962311917874,0.12661329648278288,0.12660681826145187,0.12660018940340356,0.12659341078038139,0.12658648319416638,0.12657940738241952,0.12657218402393366,0.12656481374328024,0.12655729711505168,0.12629797185444605]
[null,"Ripple",{"$f":"I103/Iout_PreReg","v":0.33514440611236901},"Actual inductor ripple current at nominal input voltage",null,null,null,"IL RMS",{"$f":"SQRT((I43-I44/2)^2+I44^2/12)","v":0.80083538877998883},{"$f":"SQRT((J43-J44/2)^2+J44^2/12)","v":0.80083239885672031},0.80083319926856344,0.8008338231518547,0.80083433287110561,0.80083471804121376,0.8008350133194988,0.80083524180576604,0.80083541954409043,0.80083555746432811,0.80083566362772007,0.80083574408638514,0.80083580340124716,0.8008359125083645,0.80083598229511799,0.80083596761139531,0.80083594909019351,0.80083592695470329,0.80083590139781213,0.80083587258704148,0.80083584066855151,0.80083580577041347,0.80083576800529932,0.80083572747270515,0.80083568426080365,0.80083563844799011,0.80083559010418326,0.80083553929192486,0.80083548606731081,0.80083543048078598,0.80083537257782267,0.80083531239950589,0.80083524998303524,0.80083518536216081,0.80083511856756073,0.80083504962717056,0.80083497856647079,0.80083490540873836,0.80083483017526869,0.80083475288556993,0.80083467355753557,0.8008345922075969,0.80083450885085816,0.80083442350121781,0.80083433617147448,0.80083424687342419,0.80083415561794591,0.80083406241507793,0.80083396727408851,0.80083387020380858,0.800833771212769,0.80083035957030102]
[null,null,null,null,null,null,null,"I_hi_sw buck RMS",{"$f":"SQRT(I39*((I43-I44/2)^2+I44^2/12))","v":0.64843446881242972},{"$f":"SQRT(J39*((J43-J44/2)^2+J44^2/12))","v":0.64907201225450661},0.64890180877908821,0.64876890768151851,0.64866016965350837,0.64857790920192127,0.6485147926607473,0.64846592072690323,0.64842788391546957,0.64839835653130629,0.64837562093440426,0.64835838608935747,0.64834567814598409,0.64832229743615721,0.6483073386753001,0.6483104862398289,0.64831445625086581,0.6483192007425912,0.64832467823553075,0.64833085267977597,0.64833769259744833,0.64834517038209194,0.64835326172260976,0.64836194512674361,0.64837120152466021,0.64838101393740322,0.64839136719819279,0.64840224771702748,0.64841364328095097,0.64842554288385446,0.64843793658084925,0.64845081536317972,0.64846417105037679,0.64847799619695268,0.64849228401139725,0.64850702828563289,0.64852222333338561,0.64853786393618684,0.64855394529592747,0.64857046299305809,0.64858741294966427,0.64860479139677019,0.64862259484531581,0.64864082006033519,0.64865946403793151,0.64867852398470394,0.6486979972993252,0.64871788155601351,0.64873817448967552,0.64875887398297694,0.64877997805440513,0.64950412974297655]
[null,"Output Capacitor, Pre-Regulator",null,null,null,null,null,"I_lo_sw buck RMS",{"$f":"SQRT((1-I39)*((I43-I44/2)^2+I44^2/12))","v":0.46996814740824511},{"$f":"SQRT((1-J39)*((J43-J44/2)^2+J44^2/12))","v":0.4690821398928921},0.46931892739793724,0.46950369192344521,0.46965478067426353,0.46976902975336154,0.46985666139646226,0.4699244983759725,0.46997728515032067,0.47001825639724076,0.47004979982548295,0.47007370932014259,0.47009133754914595,0.47012376818260077,0.47014451518478473,0.47014014979743696,0.47013464366214841,0.47012806324435319,0.47012046600679047,0.47011190187631152,0.47010241443404882,0.47009204188771758,0.47008081787102374,0.47006877210489362,0.47005593094751824,0.47004231785436601,0.47002795376485174,0.47001285742891619,0.46999704568410816,0.46998053369168852,0.4699633351386367,0.46994546241116292,0.4699269267442952,0.46990773835129757,0.46988790653601675,0.46986743979072448,0.46984634588158919,0.46982463192356255,0.46980230444617715,0.46977936945151405,0.46975583246540564,0.4697316985827763,0.46970697250788662,0.46968165859013883,0.46965576085600141,0.46962928303753643,0.46960222859794121,0.46957460075446467,0.4695464024990067,0.46951763661650708,0.46948830570163436,0.46848014926602416]
[null,"Vripple",0.01,"Enter VREG maximum output switching frequency ripple",null,null,null,"I cout RMS",{"$f":"SQRT(((I43-I44/2-Iout_sync_buck)^2+I44^2/12))","v":3.6569385033576353E-2},3.6503849952976834E-2,3.6521405401401683E-2,3.653508308862452E-2,3.6546254282747402E-2,3.6554693519167535E-2,3.656116186955774E-2,3.6566166291954402E-2,3.6570058734320614E-2,3.6573078881719026E-2,3.65754034549109E-2,3.6577165094377702E-2,3.6578463736847096E-2,3.6580852412165618E-2,3.6582380234609982E-2,3.6582058783931885E-2,3.6581653318272553E-2,3.658116872229001E-2,3.6580609216613436E-2,3.6579978466042842E-2,3.6579279667327831E-2,3.6578515620866912E-2,3.6577688789648996E-2,3.6576801348000107E-2,3.6575855222128549E-2,3.6574852124029424E-2,3.6573793579980432E-2,3.6572680954606862E-2,3.6571515471297167E-2,3.6570298229597654E-2,3.6569030220093883E-2,3.6567712337191707E-2,{"$f":"SQRT(((AO43-AO44/2-Iout_sync_buck)^2+AO44^2/12))","v":3.6566345390135285E-2},3.6564930112538703E-2,3.656346717065985E-2,3.6561957170605425E-2,3.6560400664624737E-2,3.6558798156623731E-2,3.6557150107009363E-2,3.6555456936957428E-2,3.6553719032182047E-2,3.6551936746273404E-2,3.6550110403660296E-2,3.6548240302245634E-2,3.6546326715756326E-2,3.6544369895843032E-2,3.6542370073959995E-2,3.6540327463051608E-2,3.6538242259068474E-2,3.6536114642308846E-2,3.6533944778643267E-2,3.64590840241341E-2]
[null,"I Step",0.5,"Enter load step",null,null,"Adj BUCK High Side FET","Rds_On Buck",{"$f":"Buck_RdsON_factor_7V*(I4-150)+Adj_buck_hi_rdsON_150","v":0.29210995323475081},0.30064550092496045,0.29836593192421684,0.29658639345990789,0.29513067933740017,0.29402959845732224,0.29318486307067743,0.29253083255650081,0.29202183896514788,0.29162673658436672,0.29132252704772726,0.29109192671958634,0.29092189992162781,0.29060908517087403,0.29040895538999856,0.29045106553245204,0.29050417919384613,0.29056765485690816,0.29064093780577216,0.29072354598372169,0.29081505851760042,0.29091510634251033,0.2910233644932792,0.29113954572812772,0.29126339522430961,0.29139468614182679,0.29153321589433889,0.29167880299948845,0.29183128440651518,0.29199051321904984,0.29215635674669732,0.29232869483143953,{"$f":"Buck_RdsON_factor_7V*(AO4-150)+Adj_buck_hi_rdsON_150","v":0.29250741840475952},0.2926924282392801,0.29288363386504856,0.29308095262571948,0.29328430885404244,0.29349363314944965,0.29370886174331168,0.29392993593971278,0.29415680162147961,0.2943894088127616,0.29462771129075904,0.29487166624028299,0.29512123394573936,0.29537637751589629,0.29563706263743844,0.29590325735386036,0.29617493186671151,0.29645205835620209,0.29673461081957031,0.30643573050835315]
[null,"V transient",2.5999999999999999E-2,"Enter maximum VREG deviation due to load step",null,null,null,"Conduction Losses",{"$f":"I46^2*I49","v":0.12282267175584655},{"$f":"J46^2*J49","v":0.126660289102278},0.12563400437326783,0.12483353793969694,0.12417918927005639,0.12368452215446719,0.12330517896299853,0.12301157006389696,0.12278312880996152,0.12260583763049153,0.12246935268487089,0.12236590477852942,0.12228963691244896,0.12214933416853926,0.12205958249438219,0.12207846687402886,0.12210228629420515,0.12213075338763558,0.12216361975035772,0.12220066959324874,0.12224171459110926,0.12228658967484816,0.12233514957202897,0.12238726594550191,0.12244282501325322,0.12250172555790646,0.1225638772536374,0.12262919925313338,0.12269761898874502,0.12276907115097299,0.12284349681448702,0.12292084268745435,0.12300106046438349,0.1230841062662368,0.12316994015440488,0.12325852570744025,0.12334982965130796,0.12344382153543416,0.12354047344807717,0.12363975976557132,0.12374165693083652,0.12384614325725149,0.12395319875456795,0.12406280497403346,0.1241749448702965,0.12428960267801324,0.1244067638013624,0.12452641471492248,0.1246485428745714,0.12477313663725145,0.12490018518857,0.12927163341465436]
[null,"VIN min for transient",7,"Enter minimum input voltage for load transient spec",null,null,null,"Switching Losses",{"$f":"0.5*Vreg*Iout_sync_buck*fsw*10^3*(Vreg/SLEW_rate+Vreg/1.5)*10^-9","v":4.0707555555555545E-2},4.0707555555555545E-2,4.0707555555555545E-2,4.0707555555555545E-2,4.0707555555555545E-2,4.0707555555555545E-2,4.0707555555555545E-2,4.0707555555555545E-2,4.0707555555555545E-2,4.0707555555555545E-2,4.0707555555555545E-2,4.0707555555555545E-2,4.0707555555555545E-2,4.0707555555555545E-2,4.0707555555555545E-2,4.0707555555555545E-2,4.0707555555555545E-2,4.0707555555555545E-2,4.0707555555555545E-2,4.0707555555555545E-2,4.0707555555555545E-2,4.0707555555555545E-2,4.0707555555555545E-2,4.0707555555555545E-2,4.0707555555555545E-2,4.0707555555555545E-2,4.0707555555555545E-2,4.0707555555555545E-2,4.0707555555555545E-2,4.0707555555555545E-2,4.0707555555555545E-2,4.0707555555555545E-2,{"$f":"0.5*Vreg*Iout_sync_buck*fsw*10^3*(Vreg/SLEW_rate+Vreg/1.5)*10^-9","v":4.0707555555555545E-2},4.0707555555555545E-2,4.0707555555555545E-2,4.0707555555555545E-2,4.0707555555555545E-2,4.0707555555555545E-2,4.0707555555555545E-2,4.0707555555555545E-2,4.0707555555555545E-2,4.0707555555555545E-2,4.0707555555555545E-2,4.0707555555555545E-2,4.0707555555555545E-2,4.0707555555555545E-2,4.0707555555555545E-2,4.0707555555555545E-2,4.0707555555555545E-2,4.0707555555555545E-2,4.0707555555555545E-2,4.0707555555555545E-2]
[null,"Output Capacitor",{"$f":"ROUNDUP(MAX(X166:X168),0)","v":24},"Minimum output capacitance required",null,null,null,"Total Buck FET Losses",{"$f":"I50+I51","v":0.1635302273114021},{"$f":"J50+J51","v":0.16736784465783355},0.16634155992882338,0.16554109349525248,0.16488674482561194,0.16439207771002273,0.16401273451855408,0.16371912561945251,0.16349068436551706,0.16331339318604707,0.16317690824042644,0.16307346033408496,0.16299719246800451,0.16285688972409482,0.16276713804993773,0.1627860224295844,0.16280984184976069,0.16283830894319112,0.16287117530591327,0.16290822514880429,0.1629492701466648,0.1629941452304037,0.16304270512758451,0.16309482150105745,0.16315038056880876,0.163209281113462,0.16327143280919296,0.16333675480868892,0.16340517454430056,0.16347662670652854,0.16355105237004255,0.1636283982430099,0.16370861601993902,0.16379166182179233,0.16387749570996044,0.16396608126299581,0.1640573852068635,0.1641513770909897,0.16424802900363272,0.16434731532112687,0.16444921248639208,0.16455369881280704,0.1646607543101235,0.16477036052958902,0.16488250042585204,0.16499715823356878,0.16511431935691795,0.16523397027047804,0.16535609843012694,0.16548069219280701,0.16560774074412554,0.16997918897020992]
[null,"ESR",{"$f":"ROUNDUP(C48/(2*C54)*1000,0)","v":7},"Maximum series equivalent resistance for output capacitor",null,null,"Adj BUCK Low Side FET","Rds_On Buck",{"$f":"Buck_RdsON_factor_7V*(I4-150)+Adj_buck_lo_rdsON_150","v":0.10210995323475082},0.11064550092496045,0.10836593192421685,0.10658639345990793,0.10513067933740017,0.10402959845732226,0.10318486307067742,0.10253083255650082,0.1020218389651479,0.10162673658436672,0.10132252704772725,0.10109192671958632,0.10092189992162785,0.10060908517087404,0.10040895538999856,0.10045106553245206,0.10050417919384615,0.10056765485690819,0.10064093780577218,0.10072354598372169,0.10081505851760045,0.10091510634251034,0.10102336449327921,0.10113954572812772,0.10126339522430962,0.10139468614182677,0.1015332158943389,0.10167880299948848,0.10183128440651519,0.10199051321904984,0.10215635674669736,0.10232869483143955,{"$f":"Buck_RdsON_factor_7V*(AO4-150)+Adj_buck_lo_rdsON_150","v":0.10250741840475952},0.10269242823928008,0.10288363386504855,0.10308095262571947,0.10328430885404247,0.10349363314944966,0.10370886174331172,0.10392993593971281,0.10415680162147964,0.10438940881276162,0.10462771129075905,0.10487166624028302,0.1051212339457394,0.10537637751589629,0.10563706263743848,0.10590325735386039,0.10617493186671149,0.10645205835620208,0.10673461081957032,0.11643573050835315]
[null,"I RMS",{"$f":"ROUNDUP(IF(Topology=\"Buck\",MAX(J107:BG107),MAX(J29:BG29)),3)","v":0.76500000000000001},"Maximum RMS current in output capacitor",null,null,null,"Conduction Losses",{"$f":"I47^2*I53","v":2.2553031454500719E-2},{"$f":"J47^2*J53","v":2.4346220703676296E-2},2.386870786547194E-2,2.3495234863186526E-2,2.3189264041024817E-2,2.2957557771423404E-2,2.2779635420616166E-2,2.2641784726498897E-2,2.2534445913948872E-2,2.245109016314736E-2,2.238688956963971E-2,2.2338211493754496E-2,2.2302313416087731E-2,2.223625352683993E-2,2.2193980324273124E-2,2.2202875853872543E-2,2.2214095321655417E-2,2.2227502886168614E-2,2.2242981004985566E-2,2.2260427453624648E-2,2.2279752906090466E-2,2.2300878957857727E-2,2.2323736500049821E-2,2.2348264374374097E-2,2.2374408254014509E-2,2.2402119707535157E-2,2.2431355411902082E-2,2.246207648769882E-2,2.2494247935013086E-2,2.2527838152687444E-2,2.2562818526937419E-2,2.259916307795835E-2,2.2636848155221385E-2,2.2675852173822376E-2,2.2716155385583702E-2,2.2757739679688242E-2,2.2800588408500692E-2,2.2844686234945913E-2,2.2890018998399014E-2,2.2936573596522982E-2,2.2984337880887294E-2,2.3033300564530589E-2,2.3083451139904343E-2,2.3134779805864307E-2,2.3187277402567711E-2,2.3240935353296591E-2,2.3295745612363025E-2,2.3351700618368311E-2,2.340879325218527E-2,2.3467016799011864E-2,2.3526364914191866E-2,2.5554574794928994E-2]
[null,"Actual Capacitor value =",8.5,"Enter minimum capacitance value of ceramic capacitor with tolerance and DC bias",null,null,null,"Body Diode Losses",{"$f":"(I43-I44/2)*(2*td*10^-9*(fsw*10^3))*0.05","v":2.4000000000012414E-3},2.3999999999947874E-3,2.39999999999668E-3,2.4000000000144817E-3,2.4000000000056433E-3,2.400000000003507E-3,2.4000000000022315E-3,2.4000000000015172E-3,2.4000000000009899E-3,2.4000000000005866E-3,2.4000000000003029E-3,2.4000000000000995E-3,2.3999999999999504E-3,2.3999999999998207E-3,2.3999999999905447E-3,2.399999999991017E-3,2.3999999999919242E-3,2.3999999999930821E-3,2.3999999999943524E-3,2.3999999999956352E-3,2.3999999999968595E-3,2.3999999999979784E-3,2.3999999999989603E-3,2.3999999999997864E-3,2.4000000000004495E-3,2.4000000000009478E-3,2.4000000000012835E-3,2.4000000000014639E-3,2.4000000000014982E-3,2.4000000000013954E-3,2.4000000000011664E-3,2.4000000000008229E-3,{"$f":"(AO43-AO44/2)*(2*td*10^-9*(fsw*10^3))*0.05","v":2.4000000000003754E-3},2.399999999999835E-3,2.3999999999992118E-3,2.3999999999985144E-3,2.3999999999977538E-3,2.3999999999969371E-3,2.3999999999960724E-3,2.3999999999951664E-3,2.3999999999942266E-3,2.3999999999932582E-3,2.3999999999922673E-3,2.3999999999912577E-3,2.3999999999902346E-3,2.3999999999892011E-3,2.3999999999881616E-3,2.399999999987119E-3,2.3999999999860756E-3,2.3999999999858527E-3,2.3999999999883316E-3,2.4000000000030351E-3]
[null,"Estimated ESR",3,"Enter estimated equivalent series resistance of output capacitor used",null,null,null,"Total Buck FET Losses",{"$f":"I54+I55","v":2.4953031454501961E-2},{"$f":"J54+J55","v":2.6746220703671084E-2},2.6268707865468619E-2,2.5895234863201007E-2,2.5589264041030461E-2,2.5357557771426911E-2,2.5179635420618397E-2,2.5041784726500413E-2,2.493444591394986E-2,2.4851090163147946E-2,2.4786889569640015E-2,2.4738211493754596E-2,2.4702313416087682E-2,2.4636253526839749E-2,2.4593980324263669E-2,2.4602875853863559E-2,2.4614095321647343E-2,2.4627502886161695E-2,2.4642981004979917E-2,2.4660427453620282E-2,2.4679752906087326E-2,2.4700878957855707E-2,2.4723736500048783E-2,2.4748264374373885E-2,2.477440825401496E-2,2.4802119707536104E-2,2.4831355411903365E-2,2.4862076487700283E-2,2.4894247935014584E-2,2.4927838152688838E-2,2.4962818526938584E-2,2.4999163077959172E-2,2.5036848155221759E-2,2.5075852173822213E-2,2.5116155385582914E-2,2.5157739679686757E-2,2.5200588408498446E-2,2.5244686234942849E-2,2.5290018998395086E-2,2.5336573596518148E-2,2.538433788088152E-2,2.5433300564523847E-2,2.5483451139896609E-2,2.5534779805855563E-2,2.5587277402557944E-2,2.5640935353285793E-2,2.5695745612351186E-2,2.5751700618355432E-2,2.5808793252171346E-2,2.5867016798997715E-2,2.5926364914180197E-2,2.7954574794932029E-2]
[null,"Number of capacitors =",3,"Enter the number of parallel ceramic capacitors",null,null,"V5A LDO","Output voltage",{"$f":"IF(I21-5<I58*Iout_V5A,I21-I58*Iout_V5A,5)","v":5},5,5,5,5,5,5,5,5,5,5,5,5,5,5,5,5,5,5,5,5,5,5,5,5,5,5,5,5,5,5,5,{"$f":"IF(AO21-5<AO58*Iout_V5A,AO21-AO58*Iout_V5A,5)","v":5},5,5,5,5,5,5,5,5,5,5,5,5,5,5,5,5,5,5,5,"Output voltage","V5 LDO"]
[null,null,null,null,null,null,null,"Series pass resistance",{"$f":"(Rds_ON_V5A_150-Rds_ON_V5A_min40)/190*(I4-150)+Rds_ON_V5A_150","v":0.67455877308934786},0.70099958695396858,0.69393809988508892,0.68842557192467513,0.68391616402839261,0.68050531382209289,0.67788855249244162,0.67586254318234651,0.67428581895846529,0.6730618988438033,0.67211954013103403,0.67140520280028626,0.67087850585241804,0.66990949051807969,0.66928954268614793,0.66941998849687223,0.66958452022764803,0.66978115063179677,0.67000816134987706,0.67026405910080444,0.67054754013358497,0.67085746118516998,0.67119281560151167,0.67155271358541202,0.67193636576505222,0.67234306945158528,0.67277219708742364,0.67322318648940005,0.67369553257044101,0.6741887802853993,0.6747025185953861,0.67523637528342029,{"$f":"(Rds_ON_V5A_150-Rds_ON_V5A_min40)/190*(AO4-150)+Rds_ON_V5A_150","v":0.67579001248479098},0.67636312281997113,0.67695542603756209,0.67756666609060312,0.67819660858245601,0.67884503852896694,0.67951175839220168,0.68019658634811797,0.68089935475637697,0.68161990880533541,0.68235810530928509,0.68311381163837215,0.68388690476444791,0.68467727040847226,0.68548480227709263,0.6863094013777139,0.687150975402811,0.68800943817421356,0.68888470914241151,0.71893614922325466,"Series pass resistance"]
[null,"Boost FET",null,null,null,null,null,"Power dissipated",{"$f":"(I21-I57)*Iout_V5A","v":0},0,0,0,0,0,0,0,0,0,0,0,0,0,0,0,0,0,0,0,0,0,0,0,0,0,0,0,0,0,0,0,{"$f":"(AO21-AO57)*Iout_V5A","v":0},0,0,0,0,0,0,0,0,0,0,0,0,0,0,0,0,0,0,0,"Power dissipated"]
[null,"Rds ON boost",0.02,"Recommended boost MOSFET Rds On at 25C",null,null,"V5SNR LDO","Output voltage",{"$f":"IF(I21-5<I61*Iout_V5B,I21-I61*Iout_V5B,5)","v":5},5,5,5,5,5,5,5,5,5,5,5,5,5,5,5,5,5,5,5,5,5,5,5,5,5,5,5,5,5,5,5,{"$f":"IF(AO21-5<AO61*Iout_V5B,AO21-AO61*Iout_V5B,5)","v":5},5,5,5,5,5,5,5,5,5,5,5,5,5,5,5,5,5,5,5,"Output voltage","V5 LDO"]
[null,null,1.7999999999999999E-2,"Enter Rds ON at 25C of selected boost MOSFET",null,null,null,"Series pass resistance",{"$f":"(Rds_ON_V5B_150-Rds_ON_V5B_min40)/190*(I4-150)+Rds_ON_V5B_150","v":0.67455877308934786},0.70099958695396858,0.69393809988508892,0.68842557192467513,0.68391616402839261,0.68050531382209289,0.67788855249244162,0.67586254318234651,0.67428581895846529,0.6730618988438033,0.67211954013103403,0.67140520280028626,0.67087850585241804,0.66990949051807969,0.66928954268614793,0.66941998849687223,0.66958452022764803,0.66978115063179677,0.67000816134987706,0.67026405910080444,0.67054754013358497,0.67085746118516998,0.67119281560151167,0.67155271358541202,0.67193636576505222,0.67234306945158528,0.67277219708742364,0.67322318648940005,0.67369553257044101,0.6741887802853993,0.6747025185953861,0.67523637528342029,{"$f":"(Rds_ON_V5B_150-Rds_ON_V5B_min40)/190*(AO4-150)+Rds_ON_V5B_150","v":0.67579001248479098},0.67636312281997113,0.67695542603756209,0.67756666609060312,0.67819660858245601,0.67884503852896694,0.67951175839220168,0.68019658634811797,0.68089935475637697,0.68161990880533541,0.68235810530928509,0.68311381163837215,0.68388690476444791,0.68467727040847226,0.68548480227709263,0.6863094013777139,0.687150975402811,0.68800943817421356,0.68888470914241151,0.71893614922325466,"Series pass resistance"]
[null,"Rthj-a",60,"Enter MOSFET junction to ambient thermal resistance",null,null,null,"Power dissipated",{"$f":"(I21-I60)*Iout_V5B","v":0},0,0,0,0,0,0,0,0,0,0,0,0,0,0,0,0,0,0,0,0,0,0,0,0,0,0,0,0,0,0,0,{"$f":"(AO21-AO60)*Iout_V5B","v":0},0,0,0,0,0,0,0,0,0,0,0,0,0,0,0,0,0,0,0,"Power dissipated"]
[null,"t rise boost",22,"Enter estimated boost switch rise time",null,null,"V5CAN LDO","Output voltage",{"$f":"IF(I21-5<I64*Iout_V5CAN,I21-I64*Iout_V5CAN,5)","v":5},5,5,5,5,5,5,5,5,5,5,5,5,5,5,5,5,5,5,5,5,5,5,5,5,5,5,5,5,5,5,5,{"$f":"IF(AO21-5<AO64*Iout_V5CAN,AO21-AO64*Iout_V5CAN,5)","v":5},5,5,5,5,5,5,5,5,5,5,5,5,5,5,5,5,5,5,5,"Output voltage","V5 LDO"]
[null,"t fall boost",22,"Enter estimated boost switch fall time",null,null,null,"Series pass resistance",{"$f":"(Rds_ON_V5CAN_150-Rds_ON_V5CAN_min40)/190*(I4-150)+Rds_ON_V5CAN_150","v":0.4890000993197049},0.5041453606179227,0.50010055067524273,0.49694298234918188,0.4943599997965597,0.49240626955633399,0.49090739231694352,0.48974689701028917,0.48884375157429094,0.48814269183991177,0.48760291008377454,0.4871937386571823,0.48689204738015573,0.48633699674836822,0.48598189149502979,0.48605661067344819,0.48615085421932414,0.48626348384053225,0.48639351526318159,0.48654009313794994,0.48670247067808664,0.48687999302411217,0.48707208356599235,0.48727823262913317,0.48749798806245803,0.48773094736677552,0.487976751077975,0.48823507717832249,0.48850563635464672,0.48878816795772217,0.48908243654504679,0.489388228911253,{"$f":"(Rds_ON_V5CAN_150-Rds_ON_V5CAN_min40)/190*(AO4-150)+Rds_ON_V5CAN_150","v":0.48970535152790556},0.49003362832844033,0.49037289878524704,0.49072301623498366,0.49108384641558289,0.49145526618442137,0.49183716239204583,0.49222943088989846,0.4926319756538271,0.49304470800793848,0.4934675459356585,0.49390041346679209,0.49434324013098718,0.49479596046936902,0.49525851359725359,0.49573084281182045,0.496212895239448,0.49670462151740047,0.49720597550703088,0.51441939846528195,"Series pass resistance"]
[null,"Max Peak current",{"$f":"IF(Topology=\"Buck\",\"-\",MAX(J22:BH22))","v":1.6074969144650282},{"$f":"IF(Topology=\"Buck\",\"\",\"Maximum peak MOSFET current\")","v":"Maximum peak MOSFET current"},null,null,null,"Power dissipated",{"$f":"(I21-I63)*Iout_V5CAN","v":0},0,0,0,0,0,0,0,0,0,0,0,0,0,0,0,0,0,0,0,0,0,0,0,0,0,0,0,0,0,0,0,{"$f":"(AO21-AO63)*Iout_V5CAN","v":0},0,0,0,0,0,0,0,0,0,0,0,0,0,0,0,0,0,0,0,"Power dissipated"]
[null,"Max RMS current",{"$f":"IF(Topology=\"Buck\",\"-\",MAX(J27:BH27))","v":1.1787870621604906},{"$f":"IF(Topology=\"Buck\",\"\",\"Maximum RMS MOSFET current\")","v":"Maximum RMS MOSFET current"},null,null,"V5P LDO","Output voltage",{"$f":"IF(I21-5<I67*Iout_V5P,I21-I67*Iout_V5P,5)","v":5},5,5,5,5,5,5,5,5,5,5,5,5,5,5,5,5,5,5,5,5,5,5,5,5,5,5,5,5,5,5,5,{"$f":"IF(AO21-5<AO67*Iout_V5P,AO21-AO67*Iout_V5P,5)","v":5},5,5,5,5,5,5,5,5,5,5,5,5,5,5,5,5,5,5,5,"Output voltage","V5 LDO"]
[null,"Maximum gate charge",6.5,"At Vgs = 5V",null,null,null,"Series pass resistance",{"$f":"(Rds_ON_V5P_150-Rds_ON_V5P_min40)/190*(I4-150)+Rds_ON_V5P_150","v":0.67455877308934786},0.70099958695396858,0.69393809988508892,0.68842557192467513,0.68391616402839261,0.68050531382209289,0.67788855249244162,0.67586254318234651,0.67428581895846529,0.6730618988438033,0.67211954013103403,0.67140520280028626,0.67087850585241804,0.66990949051807969,0.66928954268614793,0.66941998849687223,0.66958452022764803,0.66978115063179677,0.67000816134987706,0.67026405910080444,0.67054754013358497,0.67085746118516998,0.67119281560151167,0.67155271358541202,0.67193636576505222,0.67234306945158528,0.67277219708742364,0.67322318648940005,0.67369553257044101,0.6741887802853993,0.6747025185953861,0.67523637528342029,{"$f":"(Rds_ON_V5P_150-Rds_ON_V5P_min40)/190*(AO4-150)+Rds_ON_V5P_150","v":0.67579001248479098},0.67636312281997113,0.67695542603756209,0.67756666609060312,0.67819660858245601,0.67884503852896694,0.67951175839220168,0.68019658634811797,0.68089935475637697,0.68161990880533541,0.68235810530928509,0.68311381163837215,0.68388690476444791,0.68467727040847226,0.68548480227709263,0.6863094013777139,0.687150975402811,0.68800943817421356,0.68888470914241151,0.71893614922325466,"Series pass resistance"]
[null,"Max Power diss",{"$f":"IF(Topology=\"Buck\",\"-\",MAX(J82:BH82))","v":0.1959077386891635},{"$f":"IF(Topology=\"Buck\",\"\",\"Maximum MOSFET power dissipation\")","v":"Maximum MOSFET power dissipation"},null,null,null,"Power dissipated",{"$f":"(I21-I66)*Iout_V5P","v":2.6249999999999971E-2},2.6249999999999971E-2,2.6249999999999971E-2,2.6249999999999971E-2,2.6249999999999971E-2,2.6249999999999971E-2,2.6249999999999971E-2,2.6249999999999971E-2,2.6249999999999971E-2,2.6249999999999971E-2,2.6249999999999971E-2,2.6249999999999971E-2,2.6249999999999971E-2,2.6249999999999971E-2,2.6249999999999971E-2,2.6249999999999971E-2,2.6249999999999971E-2,2.6249999999999971E-2,2.6249999999999971E-2,2.6249999999999971E-2,2.6249999999999971E-2,2.6249999999999971E-2,2.6249999999999971E-2,2.6249999999999971E-2,2.6249999999999971E-2,2.6249999999999971E-2,2.6249999999999971E-2,2.6249999999999971E-2,2.6249999999999971E-2,2.6249999999999971E-2,2.6249999999999971E-2,2.6249999999999971E-2,{"$f":"(AO21-AO66)*Iout_V5P","v":2.6249999999999971E-2},2.6249999999999971E-2,2.6249999999999971E-2,2.6249999999999971E-2,2.6249999999999971E-2,2.6249999999999971E-2,2.6249999999999971E-2,2.6249999999999971E-2,2.6249999999999971E-2,2.6249999999999971E-2,2.6249999999999971E-2,2.6249999999999971E-2,2.6249999999999971E-2,2.6249999999999971E-2,2.6249999999999971E-2,2.6249999999999971E-2,2.6249999999999971E-2,2.6249999999999971E-2,2.6249999999999971E-2,2.6249999999999971E-2,"Power dissipated"]
[null,"Max Vds",{"$f":"IF(Topology=\"Buck\",\"-\",Vreg+4)","v":9.35},{"$f":"IF(Topology=\"Buck\",\"\",\"Select MOSFET with higher VDS rating\")","v":"Select MOSFET with higher VDS rating"},null,null,"Buck Diode","Tj Diode",{"$f":"I72*RTHavg_Vd+Ta","v":138.24489386198937},{"$f":"J72*RTHavg_Vd+Ta","v":137.60172595322243},136.2296529377335,135.47126258688999,135.47549060724702,135.29451791051741,135.01659571495321,134.68693422515165,134.3156199555157,133.95344061048465,133.60816360479157,133.28561119436483,132.98881008984441,132.76429203192171,130.07246570702932,130.90230680250897,131.66760235859152,132.3755744976319,133.03241015488922,133.6434395650584,134.21327915796311,134.74594685384267,135.24495576765526,135.71339088530746,136.15397220753354,136.56910706214975,136.96093368775607,137.33135773879428,137.68208301547085,138.01463745523523,138.33039521549105,{"$f":"AN72*RTHavg_Vd+Ta","v":138.63059551550509},138.91635877832593,139.18870051293271,139.44854329678202,139.69672715486121,139.93401857982033,140.16111839608129,{"$f":"AU72*RTHavg_Vd+Ta","v":140.3786686369636},140.58725857622517,140.78743003275483,140.97968204849147,141.1644750242169,141.34223438506456,141.51335383691645,141.67819826594186,141.83710632604596,141.99039275269695,142.13835043627819,142.28125225759726,142.4193527540566,{"$f":"BH72*RTHavg_Vd+Ta","v":146.50338847864504},"Tj Diode","Buck Diode"]
[null,"Max TJ",{"$f":"IF(Topology=\"Buck\",\"-\",IF(ROUNDUP(MAX(J77:BH77),0)>175,\"Too High\",ROUNDUP(MAX(J77:BH77),0)))","v":137},{"$f":"IF(Topology=\"Buck\",\"\",IF(C70>175,\"Boost MOSFET temperature too high\",\"Estimated worse case boost MOSFET temperature, 175C max rated\"))","v":"Estimated worse case boost MOSFET temperature, 175C max rated"},null,null,null,"I Buck diode ON",{"$f":"I22-I23/2","v":0.66553875753173253},1.5474347487356725,1.4136055375196888,1.3011169782366239,1.2063590015032599,1.1242651467862026,1.0526798377846942,0.98994697984235147,0.9347775856190903,0.88612385891327428,0.8431501187820597,0.80518077589879367,0.77166008942978748,0.74213317362639797,0.66553875760747661,0.66553875760113401,0.66553875759295678,0.66553875758458025,0.66553875757704573,0.66553875757090286,0.66553875756632008,0.66553875756318659,0.6655387575611984,0.66553875755992764,0.66553875755887648,0.66553875755751768,0.66553875755532388,0.66553875755178837,0.66553875754643921,0.66553875753884761,0.66553875752863267,0.66553875751546343,{"$f":"AO22-AO23/2","v":0.66553875749905811},0.66553875747918356,0.66553875745565105,0.66553875742831514,0.6655387573970678,0.66553875736183676,0.66553875732258128,0.66553875727928757,0.66553875723196732,0.66553875718065303,0.66553875712539556,0.66553875706626198,0.6655387570033322,0.66553875693669717,0.66553875686645747,0.6655387567927209,0.66553875671560059,0.66553875668694551,0.66553875683074259,0.66553875755827718,"I Buck diode ON"]
[null,null,null,null,null,null,null,"Vf buck diode",{"$f":"IF(Reset=1,0.45,FORECAST(I70, OFFSET(Vd_1:Vd_3,MATCH(I70,I_Vd1:I_Vd3,1)-1,0,2), OFFSET(I_Vd1:I_Vd3,MATCH(I70,I_Vd1:I_Vd3,1)-1,0,2))+(I69-25)*vd_temp_coeff/1000)","v":0.33397077826942068},{"$f":"IF(Reset=1,0.45,FORECAST(J70, OFFSET(Vd_1:Vd_3,MATCH(J70,I_Vd1:I_Vd3,1)-1,0,2), OFFSET(I_Vd1:I_Vd3,MATCH(J70,I_Vd1:I_Vd3,1)-1,0,2))+(J69-25)*vd_temp_coeff/1000)","v":0.42414705624234356},{"$f":"IF(Reset=1,0.45,FORECAST(K70, OFFSET(Vd_1:Vd_3,MATCH(K70,I_Vd1:I_Vd3,1)-1,0,2), OFFSET(I_Vd1:I_Vd3,MATCH(K70,I_Vd1:I_Vd3,1)-1,0,2))+(K69-25)*vd_temp_coeff/1000)","v":0.41374891485149168},{"$f":"IF(Reset=1,0.45,FORECAST(L70, OFFSET(Vd_1:Vd_3,MATCH(L70,I_Vd1:I_Vd3,1)-1,0,2), OFFSET(I_Vd1:I_Vd3,MATCH(L70,I_Vd1:I_Vd3,1)-1,0,2))+(L69-25)*vd_temp_coeff/1000)","v":0.40453501293702809},{"$f":"IF(Reset=1,0.45,FORECAST(M70, OFFSET(Vd_1:Vd_3,MATCH(M70,I_Vd1:I_Vd3,1)-1,0,2), OFFSET(I_Vd1:I_Vd3,MATCH(M70,I_Vd1:I_Vd3,1)-1,0,2))+(M69-25)*vd_temp_coeff/1000)","v":0.39600172140659695},{"$f":"IF(Reset=1,0.45,FORECAST(N70, OFFSET(Vd_1:Vd_3,MATCH(N70,I_Vd1:I_Vd3,1)-1,0,2), OFFSET(I_Vd1:I_Vd3,MATCH(N70,I_Vd1:I_Vd3,1)-1,0,2))+(N69-25)*vd_temp_coeff/1000)","v":0.3888304417181373},{"$f":"IF(Reset=1,0.45,FORECAST(O70, OFFSET(Vd_1:Vd_3,MATCH(O70,I_Vd1:I_Vd3,1)-1,0,2), OFFSET(I_Vd1:I_Vd3,MATCH(O70,I_Vd1:I_Vd3,1)-1,0,2))+(O69-25)*vd_temp_coeff/1000)","v":0.38272127054267857},{"$f":"IF(Reset=1,0.45,FORECAST(P70, OFFSET(Vd_1:Vd_3,MATCH(P70,I_Vd1:I_Vd3,1)-1,0,2), OFFSET(I_Vd1:I_Vd3,MATCH(P70,I_Vd1:I_Vd3,1)-1,0,2))+(P69-25)*vd_temp_coeff/1000)","v":0.37716931651090024},{"$f":"IF(Reset=1,0.45,FORECAST(Q70, OFFSET(Vd_1:Vd_3,MATCH(Q70,I_Vd1:I_Vd3,1)-1,0,2), OFFSET(I_Vd1:I_Vd3,MATCH(Q70,I_Vd1:I_Vd3,1)-1,0,2))+(Q69-25)*vd_temp_coeff/1000)","v":0.37099456632767208},{"$f":"IF(Reset=1,0.45,FORECAST(R70, OFFSET(Vd_1:Vd_3,MATCH(R70,I_Vd1:I_Vd3,1)-1,0,2), OFFSET(I_Vd1:I_Vd3,MATCH(R70,I_Vd1:I_Vd3,1)-1,0,2))+(R69-25)*vd_temp_coeff/1000)","v":0.36559073433701134},{"$f":"IF(Reset=1,0.45,FORECAST(S70, OFFSET(Vd_1:Vd_3,MATCH(S70,I_Vd1:I_Vd3,1)-1,0,2), OFFSET(I_Vd1:I_Vd3,MATCH(S70,I_Vd1:I_Vd3,1)-1,0,2))+(S69-25)*vd_temp_coeff/1000)","v":0.36084821792809729},{"$f":"IF(Reset=1,0.45,FORECAST(T70, OFFSET(Vd_1:Vd_3,MATCH(T70,I_Vd1:I_Vd3,1)-1,0,2), OFFSET(I_Vd1:I_Vd3,MATCH(T70,I_Vd1:I_Vd3,1)-1,0,2))+(T69-25)*vd_temp_coeff/1000)","v":0.35667895967461744},{"$f":"IF(Reset=1,0.45,FORECAST(U70, OFFSET(Vd_1:Vd_3,MATCH(U70,I_Vd1:I_Vd3,1)-1,0,2), OFFSET(I_Vd1:I_Vd3,MATCH(U70,I_Vd1:I_Vd3,1)-1,0,2))+(U69-25)*vd_temp_coeff/1000)","v":0.35301263862376125},{"$f":"IF(Reset=1,0.45,FORECAST(V70, OFFSET(Vd_1:Vd_3,MATCH(V70,I_Vd1:I_Vd3,1)-1,0,2), OFFSET(I_Vd1:I_Vd3,MATCH(V70,I_Vd1:I_Vd3,1)-1,0,2))+(V69-25)*vd_temp_coeff/1000)","v":0.34973883039686171},{"$f":"IF(Reset=1,0.45,FORECAST(W70, OFFSET(Vd_1:Vd_3,MATCH(W70,I_Vd1:I_Vd3,1)-1,0,2), OFFSET(I_Vd1:I_Vd3,MATCH(W70,I_Vd1:I_Vd3,1)-1,0,2))+(W69-25)*vd_temp_coeff/1000)","v":0.34377769206446201},{"$f":"IF(Reset=1,0.45,FORECAST(X70, OFFSET(Vd_1:Vd_3,MATCH(X70,I_Vd1:I_Vd3,1)-1,0,2), OFFSET(I_Vd1:I_Vd3,MATCH(X70,I_Vd1:I_Vd3,1)-1,0,2))+(X69-25)*vd_temp_coeff/1000)","v":0.34278188274912536},{"$f":"IF(Reset=1,0.45,FORECAST(Y70, OFFSET(Vd_1:Vd_3,MATCH(Y70,I_Vd1:I_Vd3,1)-1,0,2), OFFSET(I_Vd1:I_Vd3,MATCH(Y70,I_Vd1:I_Vd3,1)-1,0,2))+(Y69-25)*vd_temp_coeff/1000)","v":0.34186352808084497},{"$f":"IF(Reset=1,0.45,FORECAST(Z70, OFFSET(Vd_1:Vd_3,MATCH(Z70,I_Vd1:I_Vd3,1)-1,0,2), OFFSET(I_Vd1:I_Vd3,MATCH(Z70,I_Vd1:I_Vd3,1)-1,0,2))+(Z69-25)*vd_temp_coeff/1000)","v":0.34101396151299135},{"$f":"IF(Reset=1,0.45,FORECAST(AA70, OFFSET(Vd_1:Vd_3,MATCH(AA70,I_Vd1:I_Vd3,1)-1,0,2), OFFSET(I_Vd1:I_Vd3,MATCH(AA70,I_Vd1:I_Vd3,1)-1,0,2))+(AA69-25)*vd_temp_coeff/1000)","v":0.34022575872337846},{"$f":"IF(Reset=1,0.45,FORECAST(AB70, OFFSET(Vd_1:Vd_3,MATCH(AB70,I_Vd1:I_Vd3,1)-1,0,2), OFFSET(I_Vd1:I_Vd3,MATCH(AB70,I_Vd1:I_Vd3,1)-1,0,2))+(AB69-25)*vd_temp_coeff/1000)","v":0.33949252343043834},{"$f":"IF(Reset=1,0.45,FORECAST(AC70, OFFSET(Vd_1:Vd_3,MATCH(AC70,I_Vd1:I_Vd3,1)-1,0,2), OFFSET(I_Vd1:I_Vd3,MATCH(AC70,I_Vd1:I_Vd3,1)-1,0,2))+(AC69-25)*vd_temp_coeff/1000)","v":0.33880871591840267},{"$f":"IF(Reset=1,0.45,FORECAST(AD70, OFFSET(Vd_1:Vd_3,MATCH(AD70,I_Vd1:I_Vd3,1)-1,0,2), OFFSET(I_Vd1:I_Vd3,MATCH(AD70,I_Vd1:I_Vd3,1)-1,0,2))+(AD69-25)*vd_temp_coeff/1000)","v":0.33816951468297118},{"$f":"IF(Reset=1,0.45,FORECAST(AE70, OFFSET(Vd_1:Vd_3,MATCH(AE70,I_Vd1:I_Vd3,1)-1,0,2), OFFSET(I_Vd1:I_Vd3,MATCH(AE70,I_Vd1:I_Vd3,1)-1,0,2))+(AE69-25)*vd_temp_coeff/1000)","v":0.33757070398615752},{"$f":"IF(Reset=1,0.45,FORECAST(AF70, OFFSET(Vd_1:Vd_3,MATCH(AF70,I_Vd1:I_Vd3,1)-1,0,2), OFFSET(I_Vd1:I_Vd3,MATCH(AF70,I_Vd1:I_Vd3,1)-1,0,2))+(AF69-25)*vd_temp_coeff/1000)","v":0.33700858184482235},{"$f":"IF(Reset=1,0.45,FORECAST(AG70, OFFSET(Vd_1:Vd_3,MATCH(AG70,I_Vd1:I_Vd3,1)-1,0,2), OFFSET(I_Vd1:I_Vd3,MATCH(AG70,I_Vd1:I_Vd3,1)-1,0,2))+(AG69-25)*vd_temp_coeff/1000)","v":0.33647988425802494},{"$f":"IF(Reset=1,0.45,FORECAST(AH70, OFFSET(Vd_1:Vd_3,MATCH(AH70,I_Vd1:I_Vd3,1)-1,0,2), OFFSET(I_Vd1:I_Vd3,MATCH(AH70,I_Vd1:I_Vd3,1)-1,0,2))+(AH69-25)*vd_temp_coeff/1000)","v":0.33598172243232238},{"$f":"IF(Reset=1,0.45,FORECAST(AI70, OFFSET(Vd_1:Vd_3,MATCH(AI70,I_Vd1:I_Vd3,1)-1,0,2), OFFSET(I_Vd1:I_Vd3,MATCH(AI70,I_Vd1:I_Vd3,1)-1,0,2))+(AI69-25)*vd_temp_coeff/1000)","v":0.33551153048133159},{"$f":"IF(Reset=1,0.45,FORECAST(AJ70, OFFSET(Vd_1:Vd_3,MATCH(AJ70,I_Vd1:I_Vd3,1)-1,0,2), OFFSET(I_Vd1:I_Vd3,MATCH(AJ70,I_Vd1:I_Vd3,1)-1,0,2))+(AJ69-25)*vd_temp_coeff/1000)","v":0.33506702161966145},{"$f":"IF(Reset=1,0.45,FORECAST(AK70, OFFSET(Vd_1:Vd_3,MATCH(AK70,I_Vd1:I_Vd3,1)-1,0,2), OFFSET(I_Vd1:I_Vd3,MATCH(AK70,I_Vd1:I_Vd3,1)-1,0,2))+(AK69-25)*vd_temp_coeff/1000)","v":0.3346461512870077},{"$f":"IF(Reset=1,0.45,FORECAST(AL70, OFFSET(Vd_1:Vd_3,MATCH(AL70,I_Vd1:I_Vd3,1)-1,0,2), OFFSET(I_Vd1:I_Vd3,MATCH(AL70,I_Vd1:I_Vd3,1)-1,0,2))+(AL69-25)*vd_temp_coeff/1000)","v":0.33424708595837949},{"$f":"IF(Reset=1,0.45,FORECAST(AM70, OFFSET(Vd_1:Vd_3,MATCH(AM70,I_Vd1:I_Vd3,1)-1,0,2), OFFSET(I_Vd1:I_Vd3,MATCH(AM70,I_Vd1:I_Vd3,1)-1,0,2))+(AM69-25)*vd_temp_coeff/1000)","v":0.33386817664484669},{"$f":"IF(Reset=1,0.45,FORECAST(AN70, OFFSET(Vd_1:Vd_3,MATCH(AN70,I_Vd1:I_Vd3,1)-1,0,2), OFFSET(I_Vd1:I_Vd3,MATCH(AN70,I_Vd1:I_Vd3,1)-1,0,2))+(AN69-25)*vd_temp_coeff/1000)","v":0.33350793628324954},{"$f":"IF(Reset=1,0.45,FORECAST(AO70, OFFSET(Vd_1:Vd_3,MATCH(AO70,I_Vd1:I_Vd3,1)-1,0,2), OFFSET(I_Vd1:I_Vd3,MATCH(AO70,I_Vd1:I_Vd3,1)-1,0,2))+(AO69-25)*vd_temp_coeff/1000)","v":0.3331650203658959},{"$f":"IF(Reset=1,0.45,FORECAST(AP70, OFFSET(Vd_1:Vd_3,MATCH(AP70,I_Vd1:I_Vd3,1)-1,0,2), OFFSET(I_Vd1:I_Vd3,MATCH(AP70,I_Vd1:I_Vd3,1)-1,0,2))+(AP69-25)*vd_temp_coeff/1000)","v":0.33283821028198279},{"$f":"IF(Reset=1,0.45,FORECAST(AQ70, OFFSET(Vd_1:Vd_3,MATCH(AQ70,I_Vd1:I_Vd3,1)-1,0,2), OFFSET(I_Vd1:I_Vd3,MATCH(AQ70,I_Vd1:I_Vd3,1)-1,0,2))+(AQ69-25)*vd_temp_coeff/1000)","v":0.33252639893853969},{"$f":"IF(Reset=1,0.45,FORECAST(AR70, OFFSET(Vd_1:Vd_3,MATCH(AR70,I_Vd1:I_Vd3,1)-1,0,2), OFFSET(I_Vd1:I_Vd3,MATCH(AR70,I_Vd1:I_Vd3,1)-1,0,2))+(AR69-25)*vd_temp_coeff/1000)","v":0.3322285783055644},{"$f":"IF(Reset=1,0.45,FORECAST(AS70, OFFSET(Vd_1:Vd_3,MATCH(AS70,I_Vd1:I_Vd3,1)-1,0,2), OFFSET(I_Vd1:I_Vd3,MATCH(AS70,I_Vd1:I_Vd3,1)-1,0,2))+(AS69-25)*vd_temp_coeff/1000)","v":0.33194382859186378},{"$f":"IF(Reset=1,0.45,FORECAST(AT70, OFFSET(Vd_1:Vd_3,MATCH(AT70,I_Vd1:I_Vd3,1)-1,0,2), OFFSET(I_Vd1:I_Vd3,MATCH(AT70,I_Vd1:I_Vd3,1)-1,0,2))+(AT69-25)*vd_temp_coeff/1000)","v":0.3316713088081229},{"$f":"IF(Reset=1,0.45,FORECAST(AU70, OFFSET(Vd_1:Vd_3,MATCH(AU70,I_Vd1:I_Vd3,1)-1,0,2), OFFSET(I_Vd1:I_Vd3,MATCH(AU70,I_Vd1:I_Vd3,1)-1,0,2))+(AU69-25)*vd_temp_coeff/1000)","v":0.33141024851435347},{"$f":"IF(Reset=1,0.45,FORECAST(AV70, OFFSET(Vd_1:Vd_3,MATCH(AV70,I_Vd1:I_Vd3,1)-1,0,2), OFFSET(I_Vd1:I_Vd3,MATCH(AV70,I_Vd1:I_Vd3,1)-1,0,2))+(AV69-25)*vd_temp_coeff/1000)","v":0.33115994058204434},{"$f":"IF(Reset=1,0.45,FORECAST(AW70, OFFSET(Vd_1:Vd_3,MATCH(AW70,I_Vd1:I_Vd3,1)-1,0,2), OFFSET(I_Vd1:I_Vd3,MATCH(AW70,I_Vd1:I_Vd3,1)-1,0,2))+(AW69-25)*vd_temp_coeff/1000)","v":0.33091973482853032},{"$f":"IF(Reset=1,0.45,FORECAST(AX70, OFFSET(Vd_1:Vd_3,MATCH(AX70,I_Vd1:I_Vd3,1)-1,0,2), OFFSET(I_Vd1:I_Vd3,MATCH(AX70,I_Vd1:I_Vd3,1)-1,0,2))+(AX69-25)*vd_temp_coeff/1000)","v":0.33068903240348868},{"$f":"IF(Reset=1,0.45,FORECAST(AY70, OFFSET(Vd_1:Vd_3,MATCH(AY70,I_Vd1:I_Vd3,1)-1,0,2), OFFSET(I_Vd1:I_Vd3,MATCH(AY70,I_Vd1:I_Vd3,1)-1,0,2))+(AY69-25)*vd_temp_coeff/1000)","v":0.3304672808259872},{"$f":"IF(Reset=1,0.45,FORECAST(AZ70, OFFSET(Vd_1:Vd_3,MATCH(AZ70,I_Vd1:I_Vd3,1)-1,0,2), OFFSET(I_Vd1:I_Vd3,MATCH(AZ70,I_Vd1:I_Vd3,1)-1,0,2))+(AZ69-25)*vd_temp_coeff/1000)","v":0.33025396958587405},{"$f":"IF(Reset=1,0.45,FORECAST(BA70, OFFSET(Vd_1:Vd_3,MATCH(BA70,I_Vd1:I_Vd3,1)-1,0,2), OFFSET(I_Vd1:I_Vd3,MATCH(BA70,I_Vd1:I_Vd3,1)-1,0,2))+(BA69-25)*vd_temp_coeff/1000)","v":0.3300486262361001},{"$f":"IF(Reset=1,0.45,FORECAST(BB70, OFFSET(Vd_1:Vd_3,MATCH(BB70,I_Vd1:I_Vd3,1)-1,0,2), OFFSET(I_Vd1:I_Vd3,MATCH(BB70,I_Vd1:I_Vd3,1)-1,0,2))+(BB69-25)*vd_temp_coeff/1000)","v":0.32985081291327345},{"$f":"IF(Reset=1,0.45,FORECAST(BC70, OFFSET(Vd_1:Vd_3,MATCH(BC70,I_Vd1:I_Vd3,1)-1,0,2), OFFSET(I_Vd1:I_Vd3,MATCH(BC70,I_Vd1:I_Vd3,1)-1,0,2))+(BC69-25)*vd_temp_coeff/1000)","v":0.32966012323271976},{"$f":"IF(Reset=1,0.45,FORECAST(BD70, OFFSET(Vd_1:Vd_3,MATCH(BD70,I_Vd1:I_Vd3,1)-1,0,2), OFFSET(I_Vd1:I_Vd3,MATCH(BD70,I_Vd1:I_Vd3,1)-1,0,2))+(BD69-25)*vd_temp_coeff/1000)","v":0.32947617951189018},{"$f":"IF(Reset=1,0.45,FORECAST(BE70, OFFSET(Vd_1:Vd_3,MATCH(BE70,I_Vd1:I_Vd3,1)-1,0,2), OFFSET(I_Vd1:I_Vd3,MATCH(BE70,I_Vd1:I_Vd3,1)-1,0,2))+(BE69-25)*vd_temp_coeff/1000)","v":0.3292986302823383},{"$f":"IF(Reset=1,0.45,FORECAST(BF70, OFFSET(Vd_1:Vd_3,MATCH(BF70,I_Vd1:I_Vd3,1)-1,0,2), OFFSET(I_Vd1:I_Vd3,MATCH(BF70,I_Vd1:I_Vd3,1)-1,0,2))+(BF69-25)*vd_temp_coeff/1000)","v":0.32912714809331672},{"$f":"IF(Reset=1,0.45,FORECAST(BG70, OFFSET(Vd_1:Vd_3,MATCH(BG70,I_Vd1:I_Vd3,1)-1,0,2), OFFSET(I_Vd1:I_Vd3,MATCH(BG70,I_Vd1:I_Vd3,1)-1,0,2))+(BG69-25)*vd_temp_coeff/1000)","v":0.32896142751482116},{"$f":"IF(Reset=1,0.45,FORECAST(BH70, OFFSET(Vd_1:Vd_3,MATCH(BH70,I_Vd1:I_Vd3,1)-1,0,2), OFFSET(I_Vd1:I_Vd3,MATCH(BH70,I_Vd1:I_Vd3,1)-1,0,2))+(BH69-25)*vd_temp_coeff/1000)","v":0.32406058473261923},"Vf buck diode"]
[null,"Buck Diode (based on SS3P5)",null,null,null,null,null,"Pdiss buck diode",{"$f":"I71*I26","v":0.11037411520378308},0.10501438294453533,9.3580441148292878E-2,8.7260521220273571E-2,8.7295754914417226E-2,8.5787649150663836E-2,8.3471630883839146E-2,8.072445182000533E-2,7.7630166254483379E-2,7.4612005057966002E-2,7.173469668590271E-2,6.9046759938715563E-2,6.6573417405770496E-2,6.4702433593295902E-2,4.2270547516550655E-2,4.9185889981402317E-2,5.5563352953160408E-2,6.1463120784075446E-2,6.6936751267204136E-2,7.2028663024087253E-2,7.6777326302179552E-2,8.1216223768936238E-2,8.5374631381051475E-2,8.9278257353087725E-2,9.2949768356515708E-2,9.6409225455204958E-2,9.9674447302969787E-2,0.10276131435240721,0.1056840249376034,0.10845531186979336,0.11108662645995869,0.1135882955347325,{"$f":"AO71*AO26","v":0.11596965595238609},0.11823917028739535,0.12040452668498908,0.12247272535325356,0.12445015373088768,0.12634265202143816,0.12815557050267082,0.12989381978940259,0.13156191503926382,0.13316401493534935,0.13470395615115371,0.13618528389646847,0.13761127905401838,0.13898498234227824,0.1403092158775405,0.14158660245580212,0.14281958283069709,0.14401043125973839,0.14516126947074096,0.17919490399321025,"Pdiss buck diode"]
[null,"Max Peak current",{"$f":"IF(Topology=\"Buck\",MAX(J102:BH102),MAX(J22:BH22))","v":1.6074969144650282},"Maximum peak diode current",null,null,"Boost Diode","Tj Boost Diode",{"$f":"I76*RTHavg_Vd_boost+Ta","v":155.02138754537964},{"$f":"J76*RTHavg_Vd_boost+Ta","v":159.36642217295724},158.49734687159571,157.7624401528879,157.13820043566579,156.59138457782177,156.10792672691571,155.67701645664681,155.2793891138393,154.81340524617008,154.38986555126317,154.00289006980316,153.64764338736433,153.32077400716042,153.95734132130161,154.15528077238429,154.32079580904022,154.45906788137393,154.57435907886307,154.67019389577325,154.74950142489649,154.81472734251338,154.86792266845438,154.91081454842495,154.94486302884675,154.97130684893207,154.99120056964807,155.00544482989082,155.01481112013781,155.01996215956706,{"$f":"AM76*RTHavg_Vd_boost+Ta","v":155.02146872975095},155.01982363873847,155.01545335050025,155.00872770660428,154.99996808236406,154.98945425311487,154.97743019362343,154.96410899180734,{"$f":"AU76*RTHavg_Vd_boost+Ta","v":154.94967702455773},154.93429751669802,154.91811358256993,154.90125083232593,154.88381961087865,154.86591692594979,154.84762811225269,154.82902827112557,154.81018351857904,154.79115206947554,154.77198518121142,154.75272794251964,154.73341998223205,{"$f":"BH76*RTHavg_Vd_boost+Ta","v":155.18805456875154},"Tj Boost Diode","Boost Diode"]
[null,"Max Average current",{"$f":"IF(Topology=\"Buck\",MAX(J106:BH106),MAX(J26:BH26))","v":0.5529672920298625},"Maximum average diode current",null,null,null,"I boost diode ON",{"$f":"IF(I17=0,I28,IF(I$12>I$14,I22,I22-I23/2))","v":0.72181439912067458},1.6074969144650282,1.4769310569102923,1.3665220672977834,1.2727391765788088,1.1905880887644531,1.1179556151546695,1.0532176472568568,0.99510996443247657,0.94260451710978421,0.894881532085127,0.85127847591992756,0.81125051087388877,0.77442000190285887,0.6994902264948375,0.70365578908083359,0.7071345050719563,0.71003752328049385,0.71245589710527646,0.71446465837437279,0.71612597581339033,0.71749162325337446,0.71860492277321264,0.71950228515171921,0.72021443909387539,0.72076741816822842,0.72118335782623866,0.72148114258780749,0.72167693429107294,0.72178460538382505,0.72181609598202545,0.72178170940796482,{"$f":"IF(AO17=0,AO28,IF(AO$12>AO$14,AO22,AO22-AO23/2))","v":0.72169035783419944},0.72154976727081543,0.72136664927401806,0.72114684529815509,0.72089544846725451,0.72061690663539002,0.72031510988416658,0.71999346502959027,0.71965495924831635,0.71930221456065813,0.7189375346061686,0.71856294490253991,0.71818022757865663,0.71779095140896454,0.71739649784182657,0.71699808360365791,0.71659678036890928,0.71619353195511215,0.71578916932162207,0.72529609709477616,"I boost diode ON"]
[null,"max Power diss",{"$f":"MAX(J72:BH72)","v":0.17919490399321025},"Maximum diode power dissipation",null,null,null,"Vf boost diode",{"$f":"IF(Reset=1,0.45,FORECAST(I74, OFFSET(Vd_1_boost:Vd_3_boost,MATCH(I74,I_Vd1_boost:I_Vd3_boost,1)-1,0,2), OFFSET(I_Vd1_boost:I_Vd3_boost,MATCH(I74,I_Vd1_boost:I_Vd3_boost,1)-1,0,2))+(I73-25)*vd_boost_temp_coeff/1000)","v":0.34659634034910136},{"$f":"IF(Reset=1,0.45,FORECAST(J74, OFFSET(Vd_1_boost:Vd_3_boost,MATCH(J74,I_Vd1_boost:I_Vd3_boost,1)-1,0,2), OFFSET(I_Vd1_boost:I_Vd3_boost,MATCH(J74,I_Vd1_boost:I_Vd3_boost,1)-1,0,2))+(J73-25)*vd_boost_temp_coeff/1000)","v":0.4303083001288952},{"$f":"IF(Reset=1,0.45,FORECAST(K74, OFFSET(Vd_1_boost:Vd_3_boost,MATCH(K74,I_Vd1_boost:I_Vd3_boost,1)-1,0,2), OFFSET(I_Vd1_boost:I_Vd3_boost,MATCH(K74,I_Vd1_boost:I_Vd3_boost,1)-1,0,2))+(K73-25)*vd_boost_temp_coeff/1000)","v":0.41942644825033054},{"$f":"IF(Reset=1,0.45,FORECAST(L74, OFFSET(Vd_1_boost:Vd_3_boost,MATCH(L74,I_Vd1_boost:I_Vd3_boost,1)-1,0,2), OFFSET(I_Vd1_boost:I_Vd3_boost,MATCH(L74,I_Vd1_boost:I_Vd3_boost,1)-1,0,2))+(L73-25)*vd_boost_temp_coeff/1000)","v":0.4102245459039125},{"$f":"IF(Reset=1,0.45,FORECAST(M74, OFFSET(Vd_1_boost:Vd_3_boost,MATCH(M74,I_Vd1_boost:I_Vd3_boost,1)-1,0,2), OFFSET(I_Vd1_boost:I_Vd3_boost,MATCH(M74,I_Vd1_boost:I_Vd3_boost,1)-1,0,2))+(M73-25)*vd_boost_temp_coeff/1000)","v":0.40240832545642691},{"$f":"IF(Reset=1,0.45,FORECAST(N74, OFFSET(Vd_1_boost:Vd_3_boost,MATCH(N74,I_Vd1_boost:I_Vd3_boost,1)-1,0,2), OFFSET(I_Vd1_boost:I_Vd3_boost,MATCH(N74,I_Vd1_boost:I_Vd3_boost,1)-1,0,2))+(N73-25)*vd_boost_temp_coeff/1000)","v":0.39556154341097899},{"$f":"IF(Reset=1,0.45,FORECAST(O74, OFFSET(Vd_1_boost:Vd_3_boost,MATCH(O74,I_Vd1_boost:I_Vd3_boost,1)-1,0,2), OFFSET(I_Vd1_boost:I_Vd3_boost,MATCH(O74,I_Vd1_boost:I_Vd3_boost,1)-1,0,2))+(O73-25)*vd_boost_temp_coeff/1000)","v":0.38950807863700443},{"$f":"IF(Reset=1,0.45,FORECAST(P74, OFFSET(Vd_1_boost:Vd_3_boost,MATCH(P74,I_Vd1_boost:I_Vd3_boost,1)-1,0,2), OFFSET(I_Vd1_boost:I_Vd3_boost,MATCH(P74,I_Vd1_boost:I_Vd3_boost,1)-1,0,2))+(P73-25)*vd_boost_temp_coeff/1000)","v":0.38411257179647024},{"$f":"IF(Reset=1,0.45,FORECAST(Q74, OFFSET(Vd_1_boost:Vd_3_boost,MATCH(Q74,I_Vd1_boost:I_Vd3_boost,1)-1,0,2), OFFSET(I_Vd1_boost:I_Vd3_boost,MATCH(Q74,I_Vd1_boost:I_Vd3_boost,1)-1,0,2))+(Q73-25)*vd_boost_temp_coeff/1000)","v":0.37913380661805796},{"$f":"IF(Reset=1,0.45,FORECAST(R74, OFFSET(Vd_1_boost:Vd_3_boost,MATCH(R74,I_Vd1_boost:I_Vd3_boost,1)-1,0,2), OFFSET(I_Vd1_boost:I_Vd3_boost,MATCH(R74,I_Vd1_boost:I_Vd3_boost,1)-1,0,2))+(R73-25)*vd_boost_temp_coeff/1000)","v":0.37329913680700405},{"$f":"IF(Reset=1,0.45,FORECAST(S74, OFFSET(Vd_1_boost:Vd_3_boost,MATCH(S74,I_Vd1_boost:I_Vd3_boost,1)-1,0,2), OFFSET(I_Vd1_boost:I_Vd3_boost,MATCH(S74,I_Vd1_boost:I_Vd3_boost,1)-1,0,2))+(S73-25)*vd_boost_temp_coeff/1000)","v":0.36799591829895206},{"$f":"IF(Reset=1,0.45,FORECAST(T74, OFFSET(Vd_1_boost:Vd_3_boost,MATCH(T74,I_Vd1_boost:I_Vd3_boost,1)-1,0,2), OFFSET(I_Vd1_boost:I_Vd3_boost,MATCH(T74,I_Vd1_boost:I_Vd3_boost,1)-1,0,2))+(T73-25)*vd_boost_temp_coeff/1000)","v":0.36315052704058814},{"$f":"IF(Reset=1,0.45,FORECAST(U74, OFFSET(Vd_1_boost:Vd_3_boost,MATCH(U74,I_Vd1_boost:I_Vd3_boost,1)-1,0,2), OFFSET(I_Vd1_boost:I_Vd3_boost,MATCH(U74,I_Vd1_boost:I_Vd3_boost,1)-1,0,2))+(U73-25)*vd_boost_temp_coeff/1000)","v":0.35870241791750235},{"$f":"IF(Reset=1,0.45,FORECAST(V74, OFFSET(Vd_1_boost:Vd_3_boost,MATCH(V74,I_Vd1_boost:I_Vd3_boost,1)-1,0,2), OFFSET(I_Vd1_boost:I_Vd3_boost,MATCH(V74,I_Vd1_boost:I_Vd3_boost,1)-1,0,2))+(V73-25)*vd_boost_temp_coeff/1000)","v":0.35460962622118269},{"$f":"IF(Reset=1,0.45,FORECAST(W74, OFFSET(Vd_1_boost:Vd_3_boost,MATCH(W74,I_Vd1_boost:I_Vd3_boost,1)-1,0,2), OFFSET(I_Vd1_boost:I_Vd3_boost,MATCH(W74,I_Vd1_boost:I_Vd3_boost,1)-1,0,2))+(W73-25)*vd_boost_temp_coeff/1000)","v":0.34498148585807892},{"$f":"IF(Reset=1,0.45,FORECAST(X74, OFFSET(Vd_1_boost:Vd_3_boost,MATCH(X74,I_Vd1_boost:I_Vd3_boost,1)-1,0,2), OFFSET(I_Vd1_boost:I_Vd3_boost,MATCH(X74,I_Vd1_boost:I_Vd3_boost,1)-1,0,2))+(X73-25)*vd_boost_temp_coeff/1000)","v":0.34528341391731576},{"$f":"IF(Reset=1,0.45,FORECAST(Y74, OFFSET(Vd_1_boost:Vd_3_boost,MATCH(Y74,I_Vd1_boost:I_Vd3_boost,1)-1,0,2), OFFSET(I_Vd1_boost:I_Vd3_boost,MATCH(Y74,I_Vd1_boost:I_Vd3_boost,1)-1,0,2))+(Y73-25)*vd_boost_temp_coeff/1000)","v":0.34553534479959458},{"$f":"IF(Reset=1,0.45,FORECAST(Z74, OFFSET(Vd_1_boost:Vd_3_boost,MATCH(Z74,I_Vd1_boost:I_Vd3_boost,1)-1,0,2), OFFSET(I_Vd1_boost:I_Vd3_boost,MATCH(Z74,I_Vd1_boost:I_Vd3_boost,1)-1,0,2))+(Z73-25)*vd_boost_temp_coeff/1000)","v":0.34574543491228538},{"$f":"IF(Reset=1,0.45,FORECAST(AA74, OFFSET(Vd_1_boost:Vd_3_boost,MATCH(AA74,I_Vd1_boost:I_Vd3_boost,1)-1,0,2), OFFSET(I_Vd1_boost:I_Vd3_boost,MATCH(AA74,I_Vd1_boost:I_Vd3_boost,1)-1,0,2))+(AA73-25)*vd_boost_temp_coeff/1000)","v":0.34592034857377013},{"$f":"IF(Reset=1,0.45,FORECAST(AB74, OFFSET(Vd_1_boost:Vd_3_boost,MATCH(AB74,I_Vd1_boost:I_Vd3_boost,1)-1,0,2), OFFSET(I_Vd1_boost:I_Vd3_boost,MATCH(AB74,I_Vd1_boost:I_Vd3_boost,1)-1,0,2))+(AB73-25)*vd_boost_temp_coeff/1000)","v":0.34606556510915154},{"$f":"IF(Reset=1,0.45,FORECAST(AC74, OFFSET(Vd_1_boost:Vd_3_boost,MATCH(AC74,I_Vd1_boost:I_Vd3_boost,1)-1,0,2), OFFSET(I_Vd1_boost:I_Vd3_boost,MATCH(AC74,I_Vd1_boost:I_Vd3_boost,1)-1,0,2))+(AC73-25)*vd_boost_temp_coeff/1000)","v":0.34618561567271033},{"$f":"IF(Reset=1,0.45,FORECAST(AD74, OFFSET(Vd_1_boost:Vd_3_boost,MATCH(AD74,I_Vd1_boost:I_Vd3_boost,1)-1,0,2), OFFSET(I_Vd1_boost:I_Vd3_boost,MATCH(AD74,I_Vd1_boost:I_Vd3_boost,1)-1,0,2))+(AD73-25)*vd_boost_temp_coeff/1000)","v":0.34628426744789159},{"$f":"IF(Reset=1,0.45,FORECAST(AE74, OFFSET(Vd_1_boost:Vd_3_boost,MATCH(AE74,I_Vd1_boost:I_Vd3_boost,1)-1,0,2), OFFSET(I_Vd1_boost:I_Vd3_boost,MATCH(AE74,I_Vd1_boost:I_Vd3_boost,1)-1,0,2))+(AE73-25)*vd_boost_temp_coeff/1000)","v":0.34636466806433114},{"$f":"IF(Reset=1,0.45,FORECAST(AF74, OFFSET(Vd_1_boost:Vd_3_boost,MATCH(AF74,I_Vd1_boost:I_Vd3_boost,1)-1,0,2), OFFSET(I_Vd1_boost:I_Vd3_boost,MATCH(AF74,I_Vd1_boost:I_Vd3_boost,1)-1,0,2))+(AF73-25)*vd_boost_temp_coeff/1000)","v":0.34642945966978139},{"$f":"IF(Reset=1,0.45,FORECAST(AG74, OFFSET(Vd_1_boost:Vd_3_boost,MATCH(AG74,I_Vd1_boost:I_Vd3_boost,1)-1,0,2), OFFSET(I_Vd1_boost:I_Vd3_boost,MATCH(AG74,I_Vd1_boost:I_Vd3_boost,1)-1,0,2))+(AG73-25)*vd_boost_temp_coeff/1000)","v":0.34648086966241831},{"$f":"IF(Reset=1,0.45,FORECAST(AH74, OFFSET(Vd_1_boost:Vd_3_boost,MATCH(AH74,I_Vd1_boost:I_Vd3_boost,1)-1,0,2), OFFSET(I_Vd1_boost:I_Vd3_boost,MATCH(AH74,I_Vd1_boost:I_Vd3_boost,1)-1,0,2))+(AH73-25)*vd_boost_temp_coeff/1000)","v":0.34652078333125536},{"$f":"IF(Reset=1,0.45,FORECAST(AI74, OFFSET(Vd_1_boost:Vd_3_boost,MATCH(AI74,I_Vd1_boost:I_Vd3_boost,1)-1,0,2), OFFSET(I_Vd1_boost:I_Vd3_boost,MATCH(AI74,I_Vd1_boost:I_Vd3_boost,1)-1,0,2))+(AI73-25)*vd_boost_temp_coeff/1000)","v":0.34655080236950059},{"$f":"IF(Reset=1,0.45,FORECAST(AJ74, OFFSET(Vd_1_boost:Vd_3_boost,MATCH(AJ74,I_Vd1_boost:I_Vd3_boost,1)-1,0,2), OFFSET(I_Vd1_boost:I_Vd3_boost,MATCH(AJ74,I_Vd1_boost:I_Vd3_boost,1)-1,0,2))+(AJ73-25)*vd_boost_temp_coeff/1000)","v":0.34657229228064612},{"$f":"IF(Reset=1,0.45,FORECAST(AK74, OFFSET(Vd_1_boost:Vd_3_boost,MATCH(AK74,I_Vd1_boost:I_Vd3_boost,1)-1,0,2), OFFSET(I_Vd1_boost:I_Vd3_boost,MATCH(AK74,I_Vd1_boost:I_Vd3_boost,1)-1,0,2))+(AK73-25)*vd_boost_temp_coeff/1000)","v":0.34658642099479098},{"$f":"IF(Reset=1,0.45,FORECAST(AL74, OFFSET(Vd_1_boost:Vd_3_boost,MATCH(AL74,I_Vd1_boost:I_Vd3_boost,1)-1,0,2), OFFSET(I_Vd1_boost:I_Vd3_boost,MATCH(AL74,I_Vd1_boost:I_Vd3_boost,1)-1,0,2))+(AL73-25)*vd_boost_temp_coeff/1000)","v":0.34659419048649193},{"$f":"IF(Reset=1,0.45,FORECAST(AM74, OFFSET(Vd_1_boost:Vd_3_boost,MATCH(AM74,I_Vd1_boost:I_Vd3_boost,1)-1,0,2), OFFSET(I_Vd1_boost:I_Vd3_boost,MATCH(AM74,I_Vd1_boost:I_Vd3_boost,1)-1,0,2))+(AM73-25)*vd_boost_temp_coeff/1000)","v":0.34659646278809209},{"$f":"IF(Reset=1,0.45,FORECAST(AN74, OFFSET(Vd_1_boost:Vd_3_boost,MATCH(AN74,I_Vd1_boost:I_Vd3_boost,1)-1,0,2), OFFSET(I_Vd1_boost:I_Vd3_boost,MATCH(AN74,I_Vd1_boost:I_Vd3_boost,1)-1,0,2))+(AN73-25)*vd_boost_temp_coeff/1000)","v":0.34659398149021731},{"$f":"IF(Reset=1,0.45,FORECAST(AO74, OFFSET(Vd_1_boost:Vd_3_boost,MATCH(AO74,I_Vd1_boost:I_Vd3_boost,1)-1,0,2), OFFSET(I_Vd1_boost:I_Vd3_boost,MATCH(AO74,I_Vd1_boost:I_Vd3_boost,1)-1,0,2))+(AO73-25)*vd_boost_temp_coeff/1000)","v":0.34658738958960367},{"$f":"IF(Reset=1,0.45,FORECAST(AP74, OFFSET(Vd_1_boost:Vd_3_boost,MATCH(AP74,I_Vd1_boost:I_Vd3_boost,1)-1,0,2), OFFSET(I_Vd1_boost:I_Vd3_boost,MATCH(AP74,I_Vd1_boost:I_Vd3_boost,1)-1,0,2))+(AP73-25)*vd_boost_temp_coeff/1000)","v":0.3465772443658936},{"$f":"IF(Reset=1,0.45,FORECAST(AQ74, OFFSET(Vd_1_boost:Vd_3_boost,MATCH(AQ74,I_Vd1_boost:I_Vd3_boost,1)-1,0,2), OFFSET(I_Vd1_boost:I_Vd3_boost,MATCH(AQ74,I_Vd1_boost:I_Vd3_boost,1)-1,0,2))+(AQ73-25)*vd_boost_temp_coeff/1000)","v":0.34656402983051815},{"$f":"IF(Reset=1,0.45,FORECAST(AR74, OFFSET(Vd_1_boost:Vd_3_boost,MATCH(AR74,I_Vd1_boost:I_Vd3_boost,1)-1,0,2), OFFSET(I_Vd1_boost:I_Vd3_boost,MATCH(AR74,I_Vd1_boost:I_Vd3_boost,1)-1,0,2))+(AR73-25)*vd_boost_temp_coeff/1000)","v":0.34654816718266374},{"$f":"IF(Reset=1,0.45,FORECAST(AS74, OFFSET(Vd_1_boost:Vd_3_boost,MATCH(AS74,I_Vd1_boost:I_Vd3_boost,1)-1,0,2), OFFSET(I_Vd1_boost:I_Vd3_boost,MATCH(AS74,I_Vd1_boost:I_Vd3_boost,1)-1,0,2))+(AS73-25)*vd_boost_temp_coeff/1000)","v":0.34653002362244711},{"$f":"IF(Reset=1,0.45,FORECAST(AT74, OFFSET(Vd_1_boost:Vd_3_boost,MATCH(AT74,I_Vd1_boost:I_Vd3_boost,1)-1,0,2), OFFSET(I_Vd1_boost:I_Vd3_boost,MATCH(AT74,I_Vd1_boost:I_Vd3_boost,1)-1,0,2))+(AT73-25)*vd_boost_temp_coeff/1000)","v":0.34650991980443946},{"$f":"IF(Reset=1,0.45,FORECAST(AU74, OFFSET(Vd_1_boost:Vd_3_boost,MATCH(AU74,I_Vd1_boost:I_Vd3_boost,1)-1,0,2), OFFSET(I_Vd1_boost:I_Vd3_boost,MATCH(AU74,I_Vd1_boost:I_Vd3_boost,1)-1,0,2))+(AU73-25)*vd_boost_temp_coeff/1000)","v":0.34648813616154228},{"$f":"IF(Reset=1,0.45,FORECAST(AV74, OFFSET(Vd_1_boost:Vd_3_boost,MATCH(AV74,I_Vd1_boost:I_Vd3_boost,1)-1,0,2), OFFSET(I_Vd1_boost:I_Vd3_boost,MATCH(AV74,I_Vd1_boost:I_Vd3_boost,1)-1,0,2))+(AV73-25)*vd_boost_temp_coeff/1000)","v":0.34646491828685277},{"$f":"IF(Reset=1,0.45,FORECAST(AW74, OFFSET(Vd_1_boost:Vd_3_boost,MATCH(AW74,I_Vd1_boost:I_Vd3_boost,1)-1,0,2), OFFSET(I_Vd1_boost:I_Vd3_boost,MATCH(AW74,I_Vd1_boost:I_Vd3_boost,1)-1,0,2))+(AW73-25)*vd_boost_temp_coeff/1000)","v":0.34644048152722801},{"$f":"IF(Reset=1,0.45,FORECAST(AX74, OFFSET(Vd_1_boost:Vd_3_boost,MATCH(AX74,I_Vd1_boost:I_Vd3_boost,1)-1,0,2), OFFSET(I_Vd1_boost:I_Vd3_boost,MATCH(AX74,I_Vd1_boost:I_Vd3_boost,1)-1,0,2))+(AX73-25)*vd_boost_temp_coeff/1000)","v":0.34641501491495308},{"$f":"IF(Reset=1,0.45,FORECAST(AY74, OFFSET(Vd_1_boost:Vd_3_boost,MATCH(AY74,I_Vd1_boost:I_Vd3_boost,1)-1,0,2), OFFSET(I_Vd1_boost:I_Vd3_boost,MATCH(AY74,I_Vd1_boost:I_Vd3_boost,1)-1,0,2))+(AY73-25)*vd_boost_temp_coeff/1000)","v":0.34638868454186161},{"$f":"IF(Reset=1,0.45,FORECAST(AZ74, OFFSET(Vd_1_boost:Vd_3_boost,MATCH(AZ74,I_Vd1_boost:I_Vd3_boost,1)-1,0,2), OFFSET(I_Vd1_boost:I_Vd3_boost,MATCH(AZ74,I_Vd1_boost:I_Vd3_boost,1)-1,0,2))+(AZ73-25)*vd_boost_temp_coeff/1000)","v":0.34636163646235502},{"$f":"IF(Reset=1,0.45,FORECAST(BA74, OFFSET(Vd_1_boost:Vd_3_boost,MATCH(BA74,I_Vd1_boost:I_Vd3_boost,1)-1,0,2), OFFSET(I_Vd1_boost:I_Vd3_boost,MATCH(BA74,I_Vd1_boost:I_Vd3_boost,1)-1,0,2))+(BA73-25)*vd_boost_temp_coeff/1000)","v":0.3463339991971861},{"$f":"IF(Reset=1,0.45,FORECAST(BB74, OFFSET(Vd_1_boost:Vd_3_boost,MATCH(BB74,I_Vd1_boost:I_Vd3_boost,1)-1,0,2), OFFSET(I_Vd1_boost:I_Vd3_boost,MATCH(BB74,I_Vd1_boost:I_Vd3_boost,1)-1,0,2))+(BB73-25)*vd_boost_temp_coeff/1000)","v":0.34630588589795019},{"$f":"IF(Reset=1,0.45,FORECAST(BC74, OFFSET(Vd_1_boost:Vd_3_boost,MATCH(BC74,I_Vd1_boost:I_Vd3_boost,1)-1,0,2), OFFSET(I_Vd1_boost:I_Vd3_boost,MATCH(BC74,I_Vd1_boost:I_Vd3_boost,1)-1,0,2))+(BC73-25)*vd_boost_temp_coeff/1000)","v":0.34627739622244019},{"$f":"IF(Reset=1,0.45,FORECAST(BD74, OFFSET(Vd_1_boost:Vd_3_boost,MATCH(BD74,I_Vd1_boost:I_Vd3_boost,1)-1,0,2), OFFSET(I_Vd1_boost:I_Vd3_boost,MATCH(BD74,I_Vd1_boost:I_Vd3_boost,1)-1,0,2))+(BD73-25)*vd_boost_temp_coeff/1000)","v":0.34624861796296341},{"$f":"IF(Reset=1,0.45,FORECAST(BE74, OFFSET(Vd_1_boost:Vd_3_boost,MATCH(BE74,I_Vd1_boost:I_Vd3_boost,1)-1,0,2), OFFSET(I_Vd1_boost:I_Vd3_boost,MATCH(BE74,I_Vd1_boost:I_Vd3_boost,1)-1,0,2))+(BE73-25)*vd_boost_temp_coeff/1000)","v":0.3462196284630577},{"$f":"IF(Reset=1,0.45,FORECAST(BF74, OFFSET(Vd_1_boost:Vd_3_boost,MATCH(BF74,I_Vd1_boost:I_Vd3_boost,1)-1,0,2), OFFSET(I_Vd1_boost:I_Vd3_boost,MATCH(BF74,I_Vd1_boost:I_Vd3_boost,1)-1,0,2))+(BF73-25)*vd_boost_temp_coeff/1000)","v":0.34619049589209383},{"$f":"IF(Reset=1,0.45,FORECAST(BG74, OFFSET(Vd_1_boost:Vd_3_boost,MATCH(BG74,I_Vd1_boost:I_Vd3_boost,1)-1,0,2), OFFSET(I_Vd1_boost:I_Vd3_boost,MATCH(BG74,I_Vd1_boost:I_Vd3_boost,1)-1,0,2))+(BG73-25)*vd_boost_temp_coeff/1000)","v":0.34616128033636262},{"$f":"IF(Reset=1,0.45,FORECAST(BH74, OFFSET(Vd_1_boost:Vd_3_boost,MATCH(BH74,I_Vd1_boost:I_Vd3_boost,1)-1,0,2), OFFSET(I_Vd1_boost:I_Vd3_boost,MATCH(BH74,I_Vd1_boost:I_Vd3_boost,1)-1,0,2))+(BH73-25)*vd_boost_temp_coeff/1000)","v":0.34684747708262159},"Vf boost diode"]
[null,"Max reverse voltage",{"$f":"V_AbsMax+4","v":40},"Select diode with higher reverse voltage rating",null,null,null,"Pdiss boost diode",{"$f":"I75*I28","v":0.25017822914651144},0.28638685143494452,0.27914455725584408,0.27302033460175429,0.26781833695595397,0.26326153814006098,0.25923272271540559,0.25564180379632134,0.25232824260527742,0.24844504370844275,0.24491554625151768,0.24169075057353118,0.23873036155426111,0.23600645005374193,0.2413111776793932,0.2429606730765129,0.24433996502972907,0.24549223229065631,0.24645299227009534,0.24725161575084423,0.24791251183617899,0.24845606115829338,0.24889935554573811,0.24925678787628305,0.24954052520067674,0.24976089034330101,0.24992667131021365,0.25004537342391614,0.25012342577043589,0.25016635100861889,0.25017890565087997,0.25016519643052154,{"$f":"AO75*AO28","v":0.25012877721374216},0.25007273001357105,0.24999973295774172,0.24991211750763559,0.24981191678667231,0.24970090652795224,0.24958063987276141,0.24945247702854498,0.24931761061544436,0.24917708738538916,0.24903182687999986,0.24888263749765277,0.24873023036166139,0.24857523131721398,0.24841819133176515,0.24825959552985985,0.24809987105714715,0.24793939398225043,0.24777849530327414,0.25156712141519527,"Pdiss boost diode"]
[null,"Max TJ",{"$f":"IF(Topology=\"Buck\",ROUNDUP(MAX(J152:BH152),0),ROUNDUP(MAX(J69:BH69),0))","v":147},{"$f":"IF(C77>150,\"Buck diode temperature too high\",\"Estimated worse case buck diode temperature\")","v":"Estimated worse case buck diode temperature"},null,null,"Boost FET","Tj Boost FET",{"$f":"IF(Reset=1,150,IF(Ta+Rthj_a_boost_FET*I82>190,190,Ta+Rthj_a_boost_FET*I82))","v":125},136.75446432134981,136.23554391955895,135.84631180766976,135.55030723771921,135.31854501495781,135.13483985182359,134.98764037125849,134.86853214114771,134.77124382783055,134.69105822111561,134.62437029227692,134.56838378500777,134.52090469682506,125,125,125,125,125,125,125,125,125,125,125,125,125,125,125,125,125,125,{"$f":"IF(Reset=1,150,IF(Ta+Rthj_a_boost_FET*AO82>190,190,Ta+Rthj_a_boost_FET*AO82))","v":125},125,125,125,125,125,125,125,125,125,125,125,125,125,125,125,125,125,125,125,"Tj Boost FET","Boost FET"]
[null,null,null,null,null,null,null,"Rds thermal Coeff",{"$f":"(I77+40)*(1.34655999666222-0.667409045393858)/0.828125/(190)+0.667409045393858/0.828125","v":1.5181259222823451},{"$f":"(J77+40)*(1.34655999666222-0.667409045393858)/0.828125/(190)+0.667409045393858/0.828125","v":1.5688623234771479},{"$f":"(K77+40)*(1.34655999666222-0.667409045393858)/0.828125/(190)+0.667409045393858/0.828125","v":1.5666224805567341},1.5649424178974056,1.56366475809038,1.5626643908431492,1.5618714547634158,1.5612360900460249,1.5607219770432292,1.5603020464737809,1.5599559371997964,1.5596680886496703,1.5594264311979442,1.5592214947584311,1.5181259222823451,1.5181259222823451,1.5181259222823451,1.5181259222823451,1.5181259222823451,1.5181259222823451,1.5181259222823451,1.5181259222823451,1.5181259222823451,1.5181259222823451,1.5181259222823451,1.5181259222823451,1.5181259222823451,1.5181259222823451,1.5181259222823451,1.5181259222823451,1.5181259222823451,1.5181259222823451,1.5181259222823451,1.5181259222823451,1.5181259222823451,1.5181259222823451,1.5181259222823451,1.5181259222823451,1.5181259222823451,1.5181259222823451,1.5181259222823451,1.5181259222823451,1.5181259222823451,1.5181259222823451,1.5181259222823451,1.5181259222823451,1.5181259222823451,1.5181259222823451,1.5181259222823451,1.5181259222823451,1.5181259222823451,{"$f":"(BH77+40)*(1.34655999666222-0.667409045393858)/0.828125/(190)+0.667409045393858/0.828125","v":1.5181259222823451},"Rds thermal Coeff"]
[null,"Boost Diode (based on SS3P5)",null,null,null,null,null,"Rds_On Boost FET",{"$f":"R_ds_ON_boost*I78","v":2.732626660108221E-2},{"$f":"R_ds_ON_boost*J78","v":2.823952182258866E-2},2.8199204650021212E-2,2.8168963522153298E-2,2.8145965645626839E-2,2.8127959035176685E-2,2.8113686185741484E-2,2.8102249620828447E-2,2.8092995586778125E-2,2.8085436836528054E-2,2.8079206869596335E-2,2.8074025595694063E-2,2.8069675761562995E-2,2.8065986905651756E-2,2.732626660108221E-2,2.732626660108221E-2,2.732626660108221E-2,2.732626660108221E-2,2.732626660108221E-2,2.732626660108221E-2,2.732626660108221E-2,2.732626660108221E-2,2.732626660108221E-2,2.732626660108221E-2,2.732626660108221E-2,2.732626660108221E-2,2.732626660108221E-2,2.732626660108221E-2,2.732626660108221E-2,2.732626660108221E-2,{"$f":"R_ds_ON_boost*AM78","v":2.732626660108221E-2},2.732626660108221E-2,2.732626660108221E-2,2.732626660108221E-2,2.732626660108221E-2,2.732626660108221E-2,2.732626660108221E-2,2.732626660108221E-2,{"$f":"R_ds_ON_boost*AU78","v":2.732626660108221E-2},2.732626660108221E-2,2.732626660108221E-2,2.732626660108221E-2,2.732626660108221E-2,2.732626660108221E-2,2.732626660108221E-2,2.732626660108221E-2,2.732626660108221E-2,2.732626660108221E-2,2.732626660108221E-2,2.732626660108221E-2,2.732626660108221E-2,{"$f":"R_ds_ON_boost*BH78","v":2.732626660108221E-2},"Rds_On Boost FET"]
[null,"Max Peak current",{"$f":"IF(Topology=\"Buck\",\"-\",MAX(J22:BH22))","v":1.6074969144650282},{"$f":"IF(Topology=\"Buck\",\"\",\"Maximum peak diode current\")","v":"Maximum peak diode current"},null,null,null,"Conduction Losses",{"$f":"I27^2*I79","v":0},3.9239915160642666E-2,3.059124179698024E-2,2.4104039929988077E-2,1.917063043195855E-2,1.5307926719538798E-2,1.2246174000779689E-2,9.7928493247708276E-3,7.8077121563073174E-3,6.1862402677206121E-3,4.849813489158224E-3,3.7383480085248447E-3,2.8052395540453532E-3,2.0139214176700887E-3,0,0,0,0,0,0,0,0,0,0,0,0,0,0,0,0,0,0,{"$f":"AO27^2*AO79","v":0},0,0,0,0,0,0,0,0,0,0,0,0,0,0,0,0,0,0,0,"Conduction Losses"]
[null,"Max Average current",{"$f":"IF(Topology=\"Buck\",\"-\",MAX(J28:BG28))","v":0.72181609598202545},{"$f":"IF(Topology=\"Buck\",\"\",\"Maximum average diode current\")","v":"Maximum average diode current"},null,null,null,"Switching Losses",{"$f":"IF(I14=0,0,0.5*Vreg*Iout_PreReg*I19*10^3*(t_rise_boost+t_fall_boost)*10^-9)","v":0},0.15666782352941175,0.15666782352941175,0.15666782352941175,0.15666782352941175,0.15666782352941175,0.15666782352941175,0.15666782352941175,0.15666782352941175,0.15666782352941175,0.15666782352941175,0.15666782352941175,0.15666782352941175,0.15666782352941175,0,0,0,0,0,0,0,0,0,0,0,0,0,0,0,0,0,0,{"$f":"IF(AO14=0,0,0.5*Vreg*Iout_PreReg*AO19*10^3*(t_rise_boost+t_fall_boost)*10^-9)","v":0},0,0,0,0,0,0,0,0,0,0,0,0,0,0,0,0,0,0,0,"Switching Losses"]
[null,"max Power diss",{"$f":"IF(Topology=\"Buck\",\"-\",MAX(J76:BH76))","v":0.28638685143494452},{"$f":"IF(Topology=\"Buck\",\"\",\"Maximum diode power dissipation\")","v":"Maximum diode power dissipation"},null,null,null,"Total Boost FET Losses",{"$f":"I80+I81","v":0},{"$f":"J80+J81","v":0.1959077386900544},{"$f":"K80+K81","v":0.187259065326392},0.18077186345939983,0.17583845396137029,0.17197575024895054,0.16891399753019143,0.16646067285418259,0.16447553568571907,0.16285406379713235,0.16151763701856997,0.1604061715379366,0.1594730630834571,0.15868174494708184,0,0,0,0,0,0,0,0,0,0,0,0,0,0,0,0,{"$f":"AM80+AM81","v":0},0,0,0,0,0,0,0,0,0,0,0,0,0,0,0,0,0,0,0,0,{"$f":"BH80+BH81","v":0},"Total Boost FET Losses"]
[null,"Max reverse voltage",{"$f":"IF(Topology=\"Buck\",\"-\",Vreg+4)","v":9.35},{"$f":"IF(Topology=\"Buck\",\"\",\"Select diode with higher reverse voltage rating\")","v":"Select diode with higher reverse voltage rating"},null,null,null,"Pout",{"$f":"I21*Iout_PreReg","v":3.5606323529411763},3.5606323529411763,3.5606323529411763,3.5606323529411763,3.5606323529411763,3.5606323529411763,3.5606323529411763,3.5606323529411763,3.5606323529411763,3.5606323529411763,3.5606323529411763,3.5606323529411763,3.5606323529411763,3.5606323529411763,3.5606323529411763,3.5606323529411763,3.5606323529411763,3.5606323529411763,3.5606323529411763,3.5606323529411763,3.5606323529411763,3.5606323529411763,3.5606323529411763,3.5606323529411763,3.5606323529411763,3.5606323529411763,3.5606323529411763,3.5606323529411763,3.5606323529411763,3.5606323529411763,3.5606323529411763,3.5606323529411763,{"$f":"AO21*Iout_PreReg","v":3.5606323529411763},3.5606323529411763,3.5606323529411763,3.5606323529411763,3.5606323529411763,3.5606323529411763,3.5606323529411763,3.5606323529411763,3.5606323529411763,3.5606323529411763,3.5606323529411763,3.5606323529411763,3.5606323529411763,3.5606323529411763,3.5606323529411763,3.5606323529411763,3.5606323529411763,3.5606323529411763,3.5606323529411763,3.5606323529411763]
[null,"Max TJ",{"$f":"IF(Topology=\"Buck\",\"-\",ROUNDUP(MAX(J73:BH73),0))","v":160},{"$f":"IF(Topology=\"Buck\",\"\",IF(C84>150,\"Boost diode temperature too high\",\"Estimated worse case boost diode temperature\"))","v":"Boost diode temperature too high"},null,null,null,"P loss",{"$f":"I82+I76+I72+I3+I24^2*dcr*10^-3","v":0.91893525751688709},1.7812985097333205,1.6014443673945751,1.4639926084978505,1.358629237404632,1.2750273727600629,1.2078337683554328,1.1532521799705044,1.1083150470616319,1.0705567295751377,1.0394440007078327,1.0138239181199178,0.99280166835354022,0.96778902224939645,0.7685029268238982,0.77891781614893363,0.78899696843383993,0.79881527171471933,0.80843532844426413,0.81790977595786885,0.82728311561657741,0.8365931649859375,0.84587221858611927,0.85514798169770856,0.86444432620913814,0.87378190599157179,0.88317866068874007,0.89265023033332591,0.90221029828960642,0.91187087627112007,0.92164254229903864,0.93153464023700405,{"$f":"AO82+AO76+AO72+AO3+AO24^2*dcr*10^-3","v":0.94155544780308098},0.95171231860158889,0.96201180264902408,0.97245974902292631,0.98306139359036226,0.99382143423558811,1.0047440955752549,1.0158331848017645,1.0270921400137401,1.0385240721634521,1.0501318015639756,1.0619178897454491,1.0738846673236004,1.0860342584394507,1.098368602242723,1.1108894718196369,1.1235984909058367,1.136497148744859,1.1495868132258364,1.6076267614269002]
[null,null,null,null,null,null,null,"Efficiency",{"$f":"I83/(I83+I84)","v":0.79486072375121042},{"$f":"J83/(J83+J84)","v":0.66654407263490978},0.68976742226907206,0.70863644157860273,0.72381439521919699,0.73632814443428074,0.74670392163193,0.75534993020752639,0.76261993290801156,0.76883761157221842,0.77403766355241166,0.77837280366334105,0.78196638762951742,0.78628556354063495,0.82248119378112816,0.82050724480683856,0.81860592934746435,0.81676227345941055,0.8149638807637084,0.81320043250022878,0.8114632969699177,0.80974522194160425,0.80804009053984938,0.80634272611125224,0.80464873517736979,0.8029543802247584,0.80125647603377326,0.79955230470082594,0.79783954559975567,0.79611621735335891,0.79438062951521726,0.79263134214475195,0.79086713183145474,0.78908696301424164,0.78728996366872417,0.78547540461364596,0.78364268182889996,0.78179130128979912,0.77992086591199772,0.77803106427350888,0.77612166083839995,0.77419248745386471,0.77224343593070199,0.77027445154857588,0.76828552735312894,0.76627669913319518,0.76424804098384902,0.76219966137554862,0.76013169966169725,0.75804432295577262,0.75593772334773879,0.68894230613213647]
[null," Compensation Components, Pre-Regulator",null,null,null,null,null,null,null,null,null,{"$f":"L80/L83","v":6.7695952686824025E-3}]
[null,"fcMAX",{"$f":"ROUNDDOWN(fsw/40,0)","v":50},"Recommended maximum 0dB crossover frequency",null,null,"Buck Only Mode Calculations",null,{"$f":"I2","v":12},{"$f":"Vin_min_Buck","v":6},{"$f":"J87+(Vin_max-Vin_min_Buck)/49","v":6.2448979591836737},6.4897959183673475,6.7346938775510212,6.979591836734695,7.2244897959183687,7.4693877551020424,7.7142857142857162,7.9591836734693899,8.2040816326530628,8.4489795918367356,8.6938775510204085,8.9387755102040813,9.1836734693877542,9.428571428571427,9.6734693877550999,9.9183673469387728,10.163265306122446,10.408163265306118,10.653061224489791,10.897959183673464,11.142857142857137,11.38775510204081,11.632653061224483,11.877551020408156,12.122448979591828,12.367346938775501,12.612244897959174,12.857142857142847,13.10204081632652,13.346938775510193,13.591836734693866,13.836734693877538,{"$f":"AP87+(Vin_max-Vin_min_Buck)/49","v":14.081632653061211},14.326530612244884,14.571428571428557,14.81632653061223,15.061224489795903,15.306122448979576,15.551020408163248,15.795918367346921,16.040816326530596,16.28571428571427,16.530612244897945,16.77551020408162,17.020408163265294,17.265306122448969,17.510204081632644,17.755102040816318,17.999999999999993,{"$f":"BH2","v":36},null,"Buck Only Mode Calculations"]
[null,"fc =",40,"Choose fc considering recommended fcMAX",null,null,"Buck","Pdiss total",{"$f":"I111+I115+I139+I143+I147+I151+IF(I99<5,I2*Icc,I99*Icc)","v":0.30374945309310369},0.23461652704712152,0.23388898828990665,0.23362767271412369,0.23379650616520564,0.23436465270803838,0.22850979398103338,0.23002275467005376,0.23185129919663491,0.23397932478659753,0.23639268398148996,0.2390788935788293,0.24202689448516845,0.24522685232077635,0.24866999087892894,0.2523484522529571,0.25625517874727072,0.26038381268969912,0.2647286110376551,0.2692843722752728,0.27404637357357148,0.27901031656119668,0.28417228035200992,0.28952868071487808,0.29507623446342102,0.30081192829916215,0.30673299146813982,0.31283687169449886,0.3191212139395338,0.32558384160469989,0.33222273985511802,0.33903604078833149,{"$f":"AO111+AO115+AO139+AO143+AO147+AO151+IF(AO99<5,AO2*Icc,AO99*Icc)","v":0.34602201021333412},0.35317903583861254,0.36050561669630937,0.36800035365353478,0.37566194088210658,0.3834891581751898,0.39148086401395576,0.3996359892998847,0.40795353167905307,0.41643255039394766,0.42507216160627642,0.43387153414108515,0.44282988560841108,0.45194647886384426,0.46122061877382969,0.47065164925543823,0.48023895056373345,0.48998193680283153,0.49988005363936894,0.86475047051017351,"Pdiss total","Buck"]
[null,"R_LOADTYP",{"$f":"Vreg/Iout_PreReg","v":8.0386002155929006},null,null,null,null,"Tj",{"$f":"IF(Reset=1,150,Ta+Rth_ja*I88)","v":134.11248359279313},{"$f":"IF(Reset=1,150,Ta+Rth_ja*J88)","v":132.03849581141364},{"$f":"IF(Reset=1,150,Ta+Rth_ja*K88)","v":132.01666964869719},132.00883018142372,132.01389518495617,132.03093958124114,131.85529381943101,131.90068264010162,131.95553897589906,132.01937974359794,132.09178051944471,132.17236680736488,132.26080683455504,132.3568055696233,132.46009972636787,132.57045356758871,132.68765536241813,132.81151438069097,132.94185833112965,133.07853116825819,133.22139120720715,133.37030949683589,133.5251684105603,133.68586042144634,133.85228703390263,134.02435784897486,134.2019897440442,134.38510615083496,134.57363641818603,134.767515248141,134.96668219565353,135.17108122364994,135.38066030640002,{"$f":"IF(Reset=1,150,Ta+Rth_ja*AP88)","v":135.59537107515837},135.81516850088929,136.04001060960604,136.26985822646319,136.5046747452557,136.74442592041868,136.98907967899655,137.23860595037161,137.49297651181843,137.7521648481883,138.01614602423257,138.28489656825232,138.55839436591532,138.8366185632149,139.11954947766316,139.40716851691201,139.69945810408495,{"$f":"IF(Reset=1,150,Ta+Rth_ja*BG88)","v":139.99640160918108},{"$f":"IF(Reset=1,150,Ta+Rth_ja*BH88)","v":150.94251411530522},"Tj"]
[null,"fP1",{"$f":"wp/(2*PI())","v":1.0736932256073992},"Dominant pole formed by Co and RLOAD.",null,null,null,null,null,{"$f":"J87","v":6},{"$f":"K87","v":6.2448979591836737},6.4897959183673475,6.7346938775510212,6.979591836734695,7.2244897959183687,7.4693877551020424,7.7142857142857162,7.9591836734693899,8.2040816326530628,8.4489795918367356,8.6938775510204085,8.9387755102040813,9.1836734693877542,9.428571428571427,9.6734693877550999,9.9183673469387728,10.163265306122446,10.408163265306118,10.653061224489791,10.897959183673464,11.142857142857137,11.38775510204081,11.632653061224483,11.877551020408156,12.122448979591828,12.367346938775501,12.612244897959174,12.857142857142847,13.10204081632652,13.346938775510193,13.591836734693866,13.836734693877538,14.081632653061211,14.326530612244884,14.571428571428557,14.81632653061223,15.061224489795903,15.306122448979576,15.551020408163248,15.795918367346921,16.040816326530596,16.28571428571427,16.530612244897945,16.77551020408162,17.020408163265294,17.265306122448969,17.510204081632644,17.755102040816318,17.999999999999993,36]
[null,"fZ1",{"$f":"wz/(2*PI())","v":6241.3703173292288},"Zero formed by the output capacitance and its ESR",null,null,null,"V1",{"$f":"IF(Reset=1,I2-Vreg,I2-Iout_PreReg*(I108+dcr*10^-3)-Vreg)","v":6.3893647810369689},{"$f":"IF(Reset=1,J87-Vreg,J87-Iout_PreReg*(J108+dcr*10^-3)-Vreg)","v":0.37781257059575868},0.6227218100046894,0.8676238207918443,1.1125191622739488,1.3574083125510281,1.6150256063767552,1.8599000178529348,2.1047695175849164,2.3496343561961455,2.5944947538775471,2.8393509049175858,3.0842029814398995,3.3290511365066955,3.5738955067107803,3.8187362143525512,4.0635733692779219,4.3084070704376511,4.5532374072164039,4.7980644605705294,5.0428883040060981,5.2877090044229256,5.5325266228456496,5.7773412150592112,6.0221528321630959,6.2669615210562544,6.511767324862678,6.7565702833059635,7.0013704330399129,7.2461678079410863,7.4909624393683565,7.7357543563937394,7.9805435860081673,{"$f":"IF(Reset=1,AP87-Vreg,AP87-Iout_PreReg*(AP108+dcr*10^-3)-Vreg)","v":8.2253301533053342},8.470114081646285,8.7148953928071151,8.9596741071117219,9.204450243551392,9.4492238198927136,9.6939948527751287,9.938763357799262,10.183529349607054,10.428292841954562,10.67305384777818,10.91781237925502,11.162568447857991,11.407322064406143,11.652073239110743,11.896821981617505,12.141568301045295,12.386312206021762,30.38063336588565,"V1"]
[null,"fP2",{"$f":"IF(fz_1>10*fc,MAX(fsw/2,5*fc),fz_1)","v":1000},null,null,null,null,"V3",{"$f":"IF(Reset=1,Vreg,Vreg+I154+Iout_PreReg*dcr*10^-3)","v":5.7756075896585326},{"$f":"IF(Reset=1,Vreg,Vreg+J154+Iout_PreReg*dcr*10^-3)","v":5.7903327262285975},5.7891481124997606,5.7880575314766753,5.7870502511351631,5.7861171077048077,5.7852068331055602,5.7844023577458197,5.7836511621661133,5.7829481353358103,5.782288798250403,5.7816692093706612,5.7810858865120256,5.7805357419459513,5.7800160281821853,5.7795242924393939,5.7790583382246563,5.7786161927616861,5.7781960792562481,5.777796393182089,5.7774156819243272,5.7770526272392297,5.7767060300865474,5.7763747974686961,5.7760579309740185,5.7757545167724196,5.7754637168532197,5.7751847613291085,5.7749169416580113,5.7746596046577396,5.7744121472074132,5.7741740115455142,{"$f":"IF(Reset=1,Vreg,Vreg+AO154+Iout_PreReg*dcr*10^-3)","v":5.773944681087702},5.7737236766986246,5.7735105533612865,5.7733048971954197,5.7731063227829456,5.7729144707642854,5.7727290056740612,5.7725496139888497,5.7723760023631465,5.7722078960327323,5.7720450373671905,5.7718871845555881,5.7717341104112529,5.7715856012832409,5.7714414560635587,5.7713014852804667,5.7711655102692605,5.7710333624129477,5.7709048824460254,5.7662939851678239,"V3"]
[null,"Rz",{"$f":"fc*10^3*Vreg/VFB*2*PI()*Co_tot*10^-6/(gm_POWER1*gm_EA1*10^-6)*10^-3","v":15.873769546888427},"Recommended compensation resister to achieve chosen fc",{"$f":"10^(-1*Gain1_at_fco/20)/(gm_EA1*10^-6)*10^-3/FB_Gain1","v":15.906357022693012},null,null,"Required Buck duty",{"$f":"IF(Reset=1,Vreg/I2,I92/(I91+I92))","v":0.47477358876470072},{"$f":"IF(Reset=1,Vreg/J87,J92/(J91+J92))","v":0.93874778358572808},0.90287984355093454,0.86964162271739109,0.83875527650873394,0.80998061423537082,0.78176015151089839,0.75669460384117071,0.7331823944192406,0.71108385821567743,0.69027554099586719,0.67064792016762365,0.65210349855724248,0.63455520201678262,0.61792502597666743,0.60214288707309749,0.58714564457588614,0.57287626309378226,0.55928309336955662,0.54631925221784294,0.53394208604829074,0.5221127051402551,0.51079557803497788,0.49995817719643326,0.48957066854755693,0.47960563868064099,0.47003785452110147,0.46084405103349857,0.45200274322997924,0.44349405929996699,0.43529959214653274,0.427402267005971,0.41978622315600084,{"$f":"IF(Reset=1,Vreg/AP87,AP92/(AP91+AP92))","v":0.4124367079954997},0.40533998201351912,0.39848323336468794,0.39185450093782609,0.38544260494948179,0.37923708421814267,0.37322813938132521,0.36740658140934956,0.36176378484861926,0.35629164529553903,0.35098254066141077,0.34582929584006122,0.34082515043471751,0.3359637292396791,0.33123901520645976,0.32664532465394885,0.32217728450836214,0.31782981138179517,0.15952376613277391,"Required Buck duty"]
[null,"Actual Rz used = ",15.8,"Enter the closest available 1% standard resister value",null,null,null,"ton buck",{"$f":"I93/(fsw*10^3)*10^6","v":0.23738679438235036},{"$f":"J93/(fsw*10^3)*10^6","v":0.46937389179286404},0.45143992177546727,0.43482081135869555,0.41937763825436697,0.40499030711768541,0.3908800757554492,0.37834730192058535,0.3665911972096203,0.35554192910783872,0.34513777049793359,0.33532396008381182,0.32605174927862124,0.31727760100839131,0.30896251298833372,0.30107144353654874,0.29357282228794307,0.28643813154689113,0.27964154668477831,0.27315962610892147,0.26697104302414537,0.26105635257012755,0.25539778901748894,0.24997908859821663,0.24478533427377849,0.23980281934032049,0.23501892726055074,0.23042202551674928,0.22600137161498962,0.2217470296499835,0.21764979607326637,0.2137011335029855,0.20989311157800042,{"$f":"AP93/(fsw*10^3)*10^6","v":0.20621835399774985},0.20266999100675956,0.19924161668234397,0.19592725046891304,0.1927213024747409,0.18961854210907134,0.1866140696906626,0.18370329070467478,0.18088189242430963,0.17814582264776951,0.17549127033070538,0.17291464792003061,0.17041257521735875,0.16798186461983955,0.16561950760322988,0.16332266232697443,0.16108864225418107,0.15891490569089758,{"$f":"IF(BH93>1,1000/fsw,IF(BH93*1000/fsw<0.16,0.16,BH93*1000/fsw))","v":0.16},"ton buck"]
[null,"Cz (min)",{"$f":"4*1000000000/(6.28*Rz*1000*fc*1000)","v":1.0078206885430945},"Recommended range for the compensation capacitor",null,null,null,"toff buck",{"$f":"1/(fsw*10^-3)-I94","v":0.26261320561764967},3.062610820713596E-2,4.8560078224532732E-2,6.5179188641304453E-2,8.0622361745633031E-2,9.5009692882314589E-2,0.1091199242445508,0.12165269807941465,0.1334088027903797,0.14445807089216128,0.15486222950206641,0.16467603991618818,0.17394825072137876,0.18272239899160869,0.19103748701166628,0.19892855646345126,0.20642717771205693,0.21356186845310887,0.22035845331522169,0.22684037389107853,0.23302895697585463,0.23894364742987245,0.24460221098251106,0.2500209114017834,0.25521466572622153,0.26019718065967951,0.26498107273944926,0.26957797448325072,0.27399862838501038,0.2782529703500165,0.2823502039267336,0.28629886649701453,{"$f":"1/(fsw*10^-3)-AO94","v":0.29010688842199961},0.29378164600225015,0.29733000899324047,0.30075838331765603,0.30407274953108698,0.3072786975252591,0.31038145789092864,0.31338593030933737,0.31629670929532522,0.31911810757569037,0.32185417735223049,0.32450872966929462,0.32708535207996936,0.32958742478264125,0.33201813538016045,0.33438049239677015,0.33667733767302555,0.33891135774581893,0.34108509430910239,{"$f":"BH94/BH93-BH94","v":0.8429853474423975},"toff buck"]
[null,"Cz (max)",{"$f":"1000000000/(6.28*Rz*1000*1.5*fp_1*1000)","v":6.2576576158300714},null,null,null,null,"Actual fsw",{"$f":"1/(I94+I95)*10^3","v":2000},2000,2000,2000,2000,2000,2000,2000,2000,2000,2000,2000,2000,2000,2000,2000,2000,2000,2000,2000,2000,2000,2000,2000,2000,2000,2000,2000,2000,2000,2000,2000,2000,2000,2000,2000,2000,2000,2000,2000,2000,2000,2000,2000,2000,2000,2000,2000,2000,2000,2000,{"$f":"1/(BH94+BH95)*10^3","v":997.02353832983692},"Actual fsw"]
[null,"Cp",{"$f":"MAX(1/(2*PI()*Rz*10^3*fz_1*10^3)*10^12, 1/(2*PI()*Rz*10^3*fsw/2*10^3)*10^12, 1/(2*PI()*Rz*10^3*10*fc*10^3)*10^12)","v":25.182744160110019},"Recommended HF compensation capacitor",null,null,null,"VREG_actual",{"$f":"I91*I93/(1-I93)-I154-Iout_PreReg*dcr*10^-3","v":5.3499999999999988},5.3499999999999943,5.3499999999999988,5.35,5.3499999999999979,5.3499999999999979,5.35,5.35,5.3500000000000005,5.3499999999999979,5.3499999999999988,5.3500000000000023,5.3500000000000005,5.35,5.35,5.35,5.3499999999999988,5.3499999999999988,5.35,5.3499999999999988,5.3499999999999988,5.3500000000000014,5.3500000000000014,5.3499999999999979,5.3500000000000005,5.35,5.3499999999999988,5.3499999999999988,5.35,5.3499999999999988,5.35,5.3500000000000005,{"$f":"AO91*AO93/(1-AO93)-AO154-Iout_PreReg*dcr*10^-3","v":5.3499999999999988},5.35,5.35,5.35,5.35,5.3500000000000005,5.3500000000000014,5.3500000000000014,5.3499999999999988,5.35,5.3500000000000005,5.3500000000000014,5.35,5.35,5.3500000000000005,5.3499999999999988,5.3499999999999988,5.3499999999999988,5.35,5.3499999999999979,"VREG_actual"]
[null,"Actual Cz used =",1.5,"Enter actual Cz used",null,null,null,"New duty cycle",{"$f":"IF(I95*10^-6<0,(1/(I96*10^3))*(I96*10^3),I93)","v":0.47477358876470072},{"$f":"IF(J95*10^-6<0,(1/(J96*10^3))*(J96*10^3),J93)","v":0.93874778358572808},{"$f":"IF(K95*10^-6<0,(1/(K96*10^3))*(K96*10^3),K93)","v":0.90287984355093454},0.86964162271739109,0.83875527650873394,0.80998061423537082,0.78176015151089839,0.75669460384117071,0.7331823944192406,0.71108385821567743,0.69027554099586719,0.67064792016762365,0.65210349855724248,0.63455520201678262,0.61792502597666743,0.60214288707309749,0.58714564457588614,0.57287626309378226,0.55928309336955662,0.54631925221784294,0.53394208604829074,0.5221127051402551,0.51079557803497788,0.49995817719643326,0.48957066854755693,0.47960563868064099,0.47003785452110147,0.46084405103349857,0.45200274322997924,0.44349405929996699,0.43529959214653274,0.427402267005971,0.41978622315600084,0.4124367079954997,0.40533998201351912,0.39848323336468794,0.39185450093782609,0.38544260494948179,0.37923708421814267,0.37322813938132521,0.36740658140934956,0.36176378484861926,0.35629164529553903,0.35098254066141077,0.34582929584006122,0.34082515043471751,0.3359637292396791,0.33123901520645976,0.32664532465394885,0.32217728450836214,0.31782981138179517,0.15952376613277391,"New duty cycle"]
[null,"Actual Cp used =",27,"Enter actual Cp used",null,null,null,"New VREG",{"$f":"(I2-Iout_PreReg*I108+I154)*I98-I154-Iout_PreReg*dcr*10^-3","v":5.35},{"$f":"(J87-Iout_PreReg*J108+J154)*J98-J154-Iout_PreReg*dcr*10^-3","v":5.3500000000000005},5.3500000000000005,5.35,5.35,5.35,5.35,5.35,5.35,5.35,5.3500000000000005,5.35,5.35,5.3499999999999988,5.35,5.35,5.3500000000000005,5.3499999999999988,5.3500000000000005,5.3499999999999988,5.35,5.3500000000000014,5.3500000000000005,5.35,5.3500000000000014,5.3500000000000005,5.3499999999999988,5.3499999999999988,5.35,5.35,5.35,5.35,5.3500000000000005,{"$f":"(AP87-Iout_PreReg*AP108+AP154)*AP98-AP154-Iout_PreReg*dcr*10^-3","v":5.35},5.3500000000000005,5.35,5.35,5.3500000000000005,5.3500000000000005,5.35,5.3499999999999988,5.3500000000000005,5.3500000000000005,5.3500000000000014,5.35,5.35,5.35,5.3500000000000005,5.35,5.3500000000000005,5.35,5.35,"New VREG"]
[null,"Estimated cross over",{"$f":"'Control Loop1'!$B$21","v":38.5352859371054},null,null,null,null,"New V1",{"$f":"IF(Reset=1,I2,I2-Iout_PreReg*(I108+dcr*10^-3)-I99)","v":6.3893647810369689},{"$f":"IF(Reset=1,J87,J87-Iout_PreReg*(J108+dcr*10^-3)-J99)","v":0.37781257059575779},0.62272181000468851,0.8676238207918443,1.1125191622739488,1.3574083125510281,1.6150256063767552,1.8599000178529348,2.1047695175849164,2.3496343561961455,2.5944947538775462,2.8393509049175858,3.0842029814398995,3.3290511365066964,3.5738955067107803,3.8187362143525512,4.063573369277921,4.308407070437652,4.553237407216403,4.7980644605705303,5.0428883040060981,5.2877090044229238,5.5325266228456487,5.7773412150592112,6.0221528321630942,6.2669615210562535,6.5117673248626788,6.7565702833059644,7.0013704330399129,7.2461678079410863,7.4909624393683565,7.7357543563937394,7.9805435860081664,{"$f":"IF(Reset=1,AP87,AP87-Iout_PreReg*(AP108+dcr*10^-3)-AP99)","v":8.2253301533053342},8.4701140816462832,8.7148953928071151,8.9596741071117219,9.204450243551392,9.4492238198927119,9.6939948527751287,9.9387633577992638,10.183529349607053,10.428292841954562,10.673053847778178,10.91781237925502,11.162568447857991,11.407322064406143,11.652073239110742,11.896821981617505,12.141568301045293,12.386312206021762,30.38063336588565,"New V1"]
[null,"Estimated phase margin",{"$f":"'Control Loop1'!$B$22","v":68.906657982788559},null,null,null,null,"Vin - VREG",{"$f":"I2-I99","v":6.65},{"$f":"J87-J99","v":0.64999999999999947},0.89489795918367321,1.1397959183673478,1.3846938775510216,1.6295918367346953,1.8744897959183691,2.1193877551020428,2.3642857142857165,2.6091836734693903,2.8540816326530623,3.098979591836736,3.3438775510204088,3.5887755102040826,3.8336734693877546,4.0785714285714274,4.3234693877550994,4.568367346938774,4.8132653061224451,5.0581632653061197,5.3030612244897917,5.5479591836734627,5.7928571428571365,6.0377551020408102,6.2826530612244813,6.527551020408155,6.7724489795918297,7.0173469387755025,7.2622448979591745,7.5071428571428473,7.7520408163265202,7.9969387755101931,8.2418367346938659,{"$f":"AP87-AP99","v":8.4867346938775388},8.7316326530612116,8.9765306122448845,9.2214285714285573,9.4663265306122284,9.711224489795903,9.9561224489795759,10.201020408163249,10.44591836734692,10.690816326530594,10.935714285714269,11.180612244897945,11.42551020408162,11.670408163265295,11.915306122448968,12.160204081632644,12.405102040816317,12.649999999999993,30.65]
[null,null,null,null,null,null,"Circuit Currents","Ilpk",{"$f":"Iout_PreReg+I103/2","v":0.77706455338255243},0.67857812201702639,0.68620945499994024,0.69327852915541843,0.69984505599926794,0.70596061119021569,0.71195650251251319,0.71728053355873789,0.72227331471345624,0.72696475253675286,0.73138126747937804,0.73554628619846363,0.7394806529425858,0.74320297507425037,0.74672991468297489,0.75007643583151018,0.75325601509924256,0.75628082161340382,0.75916187159581183,0.76190916152958699,0.764531783313117,0.76703802417678535,0.76943545366049926,0.77173099956290325,0.77393101445775336,0.77604133411483356,0.77806732895066633,0.78001394945921554,0.78188576642773722,0.78368700662230739,0.78542158452686062,0.78709313063522579,{"$f":"Iout_PreReg+AO103/2","v":0.78870501672474869},0.79026037848030839,0.79176213578696175,0.79321301096654317,0.79461554519703181,0.79597211332234019,0.79728493723351701,0.79855609797947946,0.79978754674571828,0.80098111482244994,0.80213852266903218,0.80326138816875092,0.80435123415706111,0.80540949529676586,0.80643752436524929,0.80743659801156786,0.80840792203480205,0.8093526362294573,0.81027181883876365,1.0229579736283414,"Ilpk","Circuit Currents"]
[null,"Inductor Calculation, Adjustable Buck",null,null,null,null,null,"ΔIL",{"$f":"I100*I98/(L_buck*10^-6*I96*10^3)","v":0.22305159169262559},2.607872891599956E-2,4.1341394881822639E-2,5.5479543192770764E-2,6.8612596880466989E-2,8.0843707262373526E-2,9.2835489906990643E-2,0.10348355199951566,0.11346911430908375,0.12285198995588709,0.13168501984145314,0.1400150572800764,0.14788379076894384,0.15532843503310342,0.16238231425162897,0.16907535655006148,0.17543451508721253,0.18148412811758471,0.18724622808485067,0.19274080795528678,0.1979860515257017,0.20299853325689249,0.20779339222870202,0.2123844840384434,0.21678451383365069,0.22100515315391073,0.22505714283228426,0.22895038385671132,0.23269401780171386,0.23629649819945117,0.23976565401779718,0.24310874624441181,{"$f":"AO100*AO98/(L_buck*10^-6*AO96*10^3)","v":0.24633251843398643},0.24944324195627729,0.25244675658139409,0.2553485069530001,0.25815357542704609,0.26086671169134862,0.26349235952799505,0.26603468103480921,0.26849757858275997,0.27088471475226805,0.27319953046203554,0.27544526147861992,0.27762495347291666,0.279741475770517,0.28179753392617374,0.28379568123798427,0.28573832930409448,0.28762775771349858,0.28946612295264146,0.71483843213848597,"ΔIL"]
[null,"Ripple Current",0.2,"Select desired inductor ripple current, 20% to 35%",null,null,null,"IL RMS",{"$f":"SQRT((I102-I103/2)^2+I103^2/12)","v":0.66864627332339632},{"$f":"SQRT((J102-J103/2)^2+J103^2/12)","v":0.66558133449015999},{"$f":"SQRT((K102-K103/2)^2+K103^2/12)","v":0.66564574942240395},0.66573142942377883,0.66583342149828539,0.66594780568515743,0.66607810365005782,0.66620885734706892,0.66634433626434519,0.66648297460070227,0.66662351932476382,0.66676496796185569,0.66690651951855084,0.6670475355666925,0.66718750923250325,0.66732604037247023,0.6674628156177369,0.66759759226938931,0.66773018525452266,0.66786045652620385,0.66798830642318385,0.66811366660748006,0.66823649427721066,0.66835676741378947,0.66847448087090799,0.66858964315074798,0.66870227374289481,0.66881240092525096,0.66892005994524406,0.66902529151481183,0.6691281405648456,0.66922865521460728,0.66932688591958023,0.66942288476767065,0.66951670489892234,0.66960840002819377,0.66969802405375711,0.66978563073765551,0.66987127344603137,0.66995500493958804,0.67003687720597271,0.67011694132719912,0.67019524737635916,0.67027184433877995,0.6703467800535754,0.67042010117217465,0.67049185313095871,0.67056208013558649,0.67063082515497252,0.67069812992320399,0.67076403494794468,0.69679600301558309,"IL RMS"]
[null,"L calculated",{"$f":"ROUNDUP((Vreg-Vout_sync_buck)*Vout_sync_buck/(Vreg*fsw*10^-3*k_ripple2*Iout_sync_buck),2)","v":3.96},"Recommended minimum inductor value",null,null,null,"Isw buck RMS",{"$f":"SQRT(I98*((I102-I103/2)^2+I103^2/12))","v":0.46072279923401305},{"$f":"SQRT(J98*((J102-J103/2)^2+J103^2/12))","v":0.6448750825106726},{"$f":"SQRT(K98*((K102-K103/2)^2+K103^2/12))","v":0.63249652229171105},0.62082503188203508,0.60979410749011365,0.5993458529029414,0.58892761882630451,0.57952305875131083,0.57056447094485763,0.56201702260225372,0.55384963592134973,0.54603447649653702,0.53854652522334523,0.53136321796052643,0.52446414054288326,0.51783076929928384,0.51144624920679138,0.50529520334907219,0.49936356855170511,0.49363845301734061,0.48810801253845926,0.48276134246873942,0.47758838311908203,0.47257983663652964,0.46772709374312849,0.46302216897230547,0.45845764325423144,0.45402661287809987,0.44972264400546508,0.44553973203045377,0.4414722651843126,0.43751499186702342,0.43366299126049535,0.42991164683849409,0.42625662243988399,0.42269384061548904,0.41921946299620144,0.4158298724618959,0.41252165691812775,0.40929159451118496,0.4061366401324345,0.40305391308052324,0.40004068576528923,0.39709437335053083,0.39421252424437542,0.39139281135611476,0.38863302404724226,0.38593106071220612,0.38328492193123442,0.38069270414361794,0.37815259379514843,0.27830329476996402,"Isw buck RMS"]
[null,"Irms",{"$f":"IF(Topology=\"buck\",MAX(J192:BG192),MAX(J45:BG45))","v":0.80083598229511799},"Maximum RMS inductor current, must be less than inductor DC rating",null,null,null,"I buck Diode avg",{"$f":"(I102-I103/2)*(1-I98)","v":0.34955853315875918},{"$f":"(J102-J103/2)*(1-J98)","v":4.0765724010091146E-2},{"$f":"(K102-K103/2)*(1-K98)","v":6.4637228257049539E-2},8.6758552454079207E-2,0.10731461293532728,0.12646526591392113,0.14524707761330499,0.16192917106694268,0.17757745771306305,0.19228489004182284,0.20613363163113602,0.2191965740109231,0.2315386053290274,0.24321767680567469,0.2542857035051731,0.26478932862237864,0.27477057476039779,0.28426740118264687,0.29331418247159713,0.30194212120417352,0.31017960499788944,0.31805251646909144,0.32558450318068244,0.33279721346856361,0.33971050306730549,0.34634261666220384,0.35271034784235689,0.35882918039053707,0.36471341339885843,0.37037627232743559,0.37583000781268294,0.38108598377161795,0.38615475612963734,0.39104614331455967,0.39576928950342893,0.40033272147589383,0.40474439981502763,0.40901176510001841,0.41314177965261328,0.41714096532834549,0.42101543778261363,0.42477093758908946,0.42841285854247557,0.43194627343821734,0.43537595758756636,0.43870641029659541,0.44194187451178985,0.44508635481212805,0.44814363390767914,0.45111728778729931,0.45401069964266333,0.5593695084459438,"I buck Diode avg"]
[null,"Ipk",{"$f":"IF(Topology=\"buck\",MAX(J187:BG187),MAX(J43:BG43))","v":0.86336254122499612},"Maximum peak inductor current, must be less than inductor saturation current",null,null,null,"I cout RMS",{"$f":"SQRT(((I102-I103/2-Iout_PreReg)^2+I103^2/12))","v":6.4389448253455939E-2},{"$f":"SQRT(((J102-J103/2-Iout_PreReg)^2+J103^2/12))","v":7.5282805798878114E-3},1.1934232731847459E-2,1.6015564598431835E-2,1.9806750639368449E-2,2.3337568075109331E-2,2.6799297544075916E-2,2.9873128301809503E-2,3.2755711845528959E-2,3.54643147357563E-2,3.801419082685209E-2,4.041886550562649E-2,4.2690373204616008E-2,4.4839456889582775E-2,4.6875736422406195E-2,4.8807851308754972E-2,5.0643582255376809E-2,5.238995511116603E-2,5.4053330094765296E-2,5.5639478678405394E-2,5.7153650072077497E-2,5.8600628910483038E-2,5.99847854695333E-2,6.1310119515647542E-2,6.2580298709000184E-2,6.3798692332852416E-2,6.4968400998633685E-2,6.6092282875370209E-2,6.7172976908317542E-2,6.8212923422009533E-2,6.9214382444800937E-2,7.0179450043281799E-2,7.1110072914010253E-2,{"$f":"SQRT(((AP102-AP103/2-Iout_PreReg)^2+AP103^2/12))","v":7.200806144549482E-2},7.2875101434157902E-2,7.3712764613241819E-2,7.4522518132534715E-2,7.5305733108806311E-2,7.6063692351448789E-2,7.6797597354611669E-2,7.7508574635759581E-2,7.819768149078847E-2,7.8865911227367788E-2,7.9514197930844036E-2,8.0143420810672883E-2,8.0754408169805586E-2,8.134794103462456E-2,8.1924756478801722E-2,8.2485550670756441E-2,8.3030981671148432E-2,8.3561672003992421E-2,0.20635608061112246]
[null,"DCR <",{"$f":"ROUNDDOWN(0.033*Vout_sync_buck*Iout_sync_buck/C106^2*1000,0)","v":135},"Recommended inductor DC resistance",null,null,"Buck","Rds_On Buck",{"$f":"IF(I2>7,Buck_RdsON_factor_7V*(I89-150)+Rds_ON_150_7V,IF(I2<5,Buck_RdsON_factor_5V*(I89-150)+Rds_ON_150,Buck_RdsON_factor_6V*(I89-150)+Rds_ON_150_6V))","v":0.25261538829580632},{"$f":"IF(J87>7,Buck_RdsON_factor_7V*(J89-150)+Rds_ON_150_7V,IF(J87<5,Buck_RdsON_factor_5V*(J89-150)+Rds_ON_150,Buck_RdsON_factor_6V*(J89-150)+Rds_ON_150_6V))","v":0.26997307078341104},0.26995612177015232,0.26995003406538787,0.26995396727220677,0.26996720302520527,0.25085586728765896,0.25089124870948154,0.25093401023374712,0.2509837752881825,0.25104021302665358,0.25110303152257163,0.25117197215292475,0.25124680493530821,0.25132732463327767,0.25141334748534322,0.25150470844339318,0.25160125882975037,0.25170286434019012,0.25180940333438934,0.2519207653663823,0.25203684991637959,0.25215756529229194,0.25228282767489363,0.25241256028505671,0.25254669265513102,0.25268515998950408,0.25282790260179444,0.25297486541812059,0.25312599753752257,0.25328125184197342,0.25344058464954189,0.25360395540521291,{"$f":"IF(AP87>7,Buck_RdsON_factor_7V*(AP89-150)+Rds_ON_150_7V,IF(AP87<5,Buck_RdsON_factor_5V*(AP89-150)+Rds_ON_150,Buck_RdsON_factor_6V*(AP89-150)+Rds_ON_150_6V))","v":0.25377132640465838},0.25394266254691561,0.25411793111248865,0.25429710156386381,0.25448014536583002,0.25466703582333861,0.25485774793492982,0.25505225826000322,0.25525054479842452,0.25545258688114686,0.25565836507068451,0.25586786107041581,0.25608105764181144,0.25629793852878902,0.25651848838848673,0.25674269272782668,0.25697053784530982,0.25720201077754418,0.26573470711498254,"Rds_On Buck","Buck"]
[null,"Lout =",4.7,"Enter select inductor value at total VREG current",null,null,null,"Conduction Losses",{"$f":"I105^2*I108","v":5.3621531131883247E-2},{"$f":"J105^2*J108","v":0.11227204656336785},{"$f":"K105^2*K108","v":0.10799644612494293},0.10404514640065703,0.10038207323595461,9.6976390695722475E-2,8.7005780418347473E-2,8.4261067089727401E-2,8.1690015131360691E-2,7.9276521769052269E-2,7.7006439544333796E-2,7.4867285254705276E-2,7.2847999806702771E-2,7.0938748820579933E-2,6.9130756089598289E-2,6.7416163707076593E-2,6.5787913977414472E-2,6.4239649228432838E-2,6.27656264175393E-2,6.1360644028863529E-2,6.0019979233423108E-2,5.8739333659863745E-2,5.751478642204879E-2,5.6342753288848475E-2,5.5219951073886962E-2,5.4143366478693514E-2,5.3110228749313003E-2,5.2117985609897811E-2,5.1164282021750537E-2,5.0246941386334794E-2,4.9363948868780115E-2,4.8513436566639166E-2,4.7693670288914719E-2,4.6903037744102496E-2,4.6140037964354279E-2,4.540327181678936E-2,4.4691433473234156E-2,4.4003302726862377E-2,4.3337738058853777E-2,4.2693670370696594E-2,4.2070097308474906E-2,4.1466078114683037E-2,4.0880728951036109E-2,4.031321864258644E-2,3.9762764799377896E-2,3.9228630277006536E-2,3.8710119941923075E-2,3.8206577711203955E-2,3.7717383839917337E-2,3.7241952432184922E-2,3.6779729154646987E-2,2.0581876895460913E-2,"Conduction Losses"]
[null,"Lout DCR",95,"Enter select inductor DC resistance",null,null,null,"Switching Losses",{"$f":"IF(I98=1,0,0.5*I87*Iout_PreReg*I96*10^3*(I87/SLEW_rate+I87/1.5)*10^-9)","v":0.17037792193512921},4.2594480483782303E-2,4.6142542165063631E-2,4.9832526313596207E-2,5.3664432929380057E-2,5.7638262012415127E-2,6.1754013562701472E-2,6.6011687580239051E-2,7.0411284065027918E-2,7.495280301706804E-2,7.9636244436359346E-2,8.4461608322901949E-2,8.9428894676695778E-2,9.4538103497740902E-2,9.978923478603724E-2,0.10518228854158485,0.11071726476438368,0.11639416345443378,0.12221298461173512,0.12817372823628775,0.1342763943280916,0.14052098288714673,0.14690749391345312,0.15343592740701067,0.1601062833678196,0.16691856179587966,0.17387276269119109,0.18096888605375369,0.18820693188356757,0.19558690018063266,0.2031087909449491,0.21077260417651672,{"$f":"IF(AO98=1,0,0.5*AO87*Iout_PreReg*AO96*10^3*(AO87/SLEW_rate+AO87/1.5)*10^-9)","v":0.21857833987533556},0.22652599804140575,0.23461557867472715,0.24284708177529979,0.25122050734312368,0.25973585537819888,0.26839312588052522,0.27719231885010287,0.28613343428693178,0.29521647219101194,0.30444143256234335,0.31380831540092613,0.32331712070676011,0.33296784847984534,0.34276049872018188,0.35269507142776962,0.36277156660260873,0.37298998424469887,0.38335032435404043,0.76441859361471265,"Switching Losses"]
[null,"Ripple",{"$f":"I44/Iout_sync_buck","v":0.15835008219925784},"Actual inductor ripple current at nominal input voltage",null,null,null,"Total Buck FET Losses",{"$f":"I109+I110","v":0.22399945306701247},{"$f":"J109+J110","v":0.15486652704715015},{"$f":"K109+K110","v":0.15413898829000655},0.15387767271425323,0.15404650616533466,0.1546146527081376,0.14875979398104894,0.15027275466996645,0.1521012991963886,0.15422932478612031,0.15664268398069314,0.15932889357760721,0.16227689448339855,0.16547685231832082,0.16891999087563553,0.17259845224866144,0.17650517874179816,0.1806338126828666,0.18497861102927443,0.1895343722651513,0.19429637356151472,0.19926031654701049,0.20442228033550192,0.20977868069585914,0.21532623444170657,0.22106192827457316,0.2269829914405041,0.2330868716636515,0.23937121390531813,0.24583384156696744,0.2524727398137292,0.25928604074315587,0.26627201016425028,0.27342903578550826,0.28075561663908144,0.28825035359208917,0.29591194081635785,0.30373915810506125,0.31173086393937899,0.31988598922079947,0.32820353159540666,0.33668255030569499,0.34532216151337947,0.35412153404351254,0.36307988550613801,0.37219647875685186,0.38147061866210497,0.39090164913897357,0.40048895044252608,0.41023193667688379,0.42013005350868743,0.78500047051017352,"Total Buck FET Losses"]
[null,null,null,null,null,null,"3V3 LDO","Output voltage",{"$f":"IF(I99-3.3<I113*Iout_3V3,I99-I113*Iout_3V3,3.3)","v":3.3},3.3,3.3,3.3,3.3,3.3,3.3,3.3,3.3,3.3,3.3,3.3,3.3,3.3,3.3,3.3,3.3,3.3,3.3,3.3,3.3,3.3,3.3,3.3,3.3,3.3,3.3,3.3,3.3,3.3,3.3,3.3,{"$f":"IF(AO99-3.3<AO113*Iout_3V3,AO99-AO113*Iout_3V3,3.3)","v":3.3},3.3,3.3,3.3,3.3,3.3,3.3,3.3,3.3,3.3,3.3,3.3,3.3,3.3,3.3,3.3,3.3,3.3,3.3,3.3,"Output voltage","5V0 LDO"]
[null,"Output Capacitor, Adjustable Buck",null,null,null,null,null,"Series pass resistance",{"$f":"(Rds_ON_3V3_150-Rds_ON_3V3_min40)/190*(I89-150)+Rds_ON_3V3_150","v":0.48830822824870396},0.48639033533718617,0.4863701518804005,0.48636290243619024,0.48636758623156212,0.48638334781275827,0.48622092170565279,0.48626289442034659,0.48631362209508139,0.48637265800500085,0.48643960966982336,0.48651413077923161,0.48659591453069118,0.4866846880978043,0.48678020801012017,0.48688225627276494,0.48699063709040458,0.48710517408782844,0.48722570794094461,0.48735209434875243,0.48748420229003314,0.48762191251891612,0.4877651162617655,0.48791371408446382,0.4880676149045089,0.48822673512665726,0.48839099788436086,0.48856033237211421,0.48873467325618569,0.48891396015314931,0.48909813716724382,0.48928715247892263,{"$f":"(Rds_ON_3V3_150-Rds_ON_3V3_min40)/190*(AO89-150)+Rds_ON_3V3_150","v":0.48948095797807623},0.48967950893634382,0.48988276371371708,0.4900906834953041,0.49030323205468201,0.49052037554074435,0.4907420822853556,0.4909683226294721,0.49119906876568575,0.49143429459540261,0.49167397559908782,0.4919180887181982,0.49216661224758912,0.49241952573732273,0.49267680990293083,0.49293844654329166,0.49320441846537599,0.49347470941519855,0.49374930401438483,0.50387157752662703,"Series pass resistance"]
[null,"Vripple",5.0000000000000001E-3,"Enter VREG maximum output switching frequency ripple",null,null,null,"Dropout",{"$f":"I99-I112","v":2.0499999999999998},{"$f":"J99-J112","v":2.0500000000000007},2.0500000000000007,2.0499999999999998,2.0499999999999998,2.0499999999999998,2.0499999999999998,2.0499999999999998,2.0499999999999998,2.0499999999999998,2.0500000000000007,2.0499999999999998,2.0499999999999998,2.0499999999999989,2.0499999999999998,2.0499999999999998,2.0500000000000007,2.0499999999999989,2.0500000000000007,2.0499999999999989,2.0499999999999998,2.0500000000000016,2.0500000000000007,2.0499999999999998,2.0500000000000016,2.0500000000000007,2.0499999999999989,2.0499999999999989,2.0499999999999998,2.0499999999999998,2.0499999999999998,2.0499999999999998,2.0500000000000007,2.0499999999999998,2.0500000000000007,2.0499999999999998,2.0499999999999998,2.0500000000000007,2.0500000000000007,2.0499999999999998,2.0499999999999989,2.0500000000000007,2.0500000000000007,2.0500000000000016,2.0499999999999998,2.0499999999999998,2.0499999999999998,2.0500000000000007,2.0499999999999998,2.0500000000000007,2.0499999999999998,2.0499999999999998,"Dropout"]
[null,"I Step",0.4,"Enter load step",null,null,null,"Power dissipated",{"$f":"(I99-I112)*Iout_3V3","v":0},0,0,0,0,0,0,0,0,0,0,0,0,0,0,0,0,0,0,0,0,0,0,0,0,0,0,0,0,0,0,0,{"$f":"(AO99-AO112)*Iout_3V3","v":0},0,0,0,0,0,0,0,0,0,0,0,0,0,0,0,0,0,0,0,"Power dissipated"]
[null,"V transient",1.4999999999999999E-2,"Enter maximum VADJ deviation due to load step",null,null,"Adj BUCK","V1",{"$f":"IF(Reset=1,Vreg-Vout_sync_buck,Vreg-Iout_sync_buck*(I128+DCR84*10^-3)-Vout_sync_buck)","v":1.8199076893686232},1.821201058707949,1.8212146698247054,1.8212195586320448,1.8212164000212114,1.8212057708845215,1.8213153061700398,1.8212870010326139,1.8212527918132482,1.821212979769764,1.821167829579073,1.8211175747824475,1.821062422278299,1.8210025560525542,1.820938140294369,1.8208693220129364,1.8207962332467469,1.8207189929379428,1.8206377085299019,1.8205524773348838,1.8204633877096601,1.8203705200700604,1.8202739477697554,1.820173737864125,1.8200699517764694,1.8199626458809064,1.8198518720139267,1.819737677924631,1.819620107672125,1.819499201977175,1.8193749985341992,1.8192475322887427,{"$f":"IF(Reset=1,Vreg-Vout_sync_buck,Vreg-Iout_sync_buck*(AO128+DDX84*10^-3)-Vout_sync_buck)","v":1.8191168356848149},1.8189829388858776,1.8188458699726997,1.8187056551208753,1.8185623187604154,1.8184158837194877,1.8182663713541292,1.8181138016655067,1.8179581934061,1.8177995641760152,1.8176379305104886,1.81747330795951,1.8173057111603734,1.8171351539039025,1.8169616491949636,1.8167852093078443,1.8166058458370067,1.816423569743649,1.8162383913984863,1.8094122343080139]
[null,"VIN min for transient",5.25,"Minimum input voltage for load transient spec",null,null,null,"V3",{"$f":"IF(Reset=1,Vout_sync_buck,Vout_sync_buck+Iout_sync_buck*(I132+dcr_2*10^-3))","v":3.4540923106313768},3.4527989412920506,3.4527853301752942,3.4527804413679553,3.4527835999787877,3.4527942291154776,3.4526846938299598,3.4527129989673857,3.4527472081867514,3.4527870202302351,3.4528321704209266,3.4528824252175525,3.4529375777217006,3.4529974439474458,3.4530618597056311,3.4531306779870632,3.4532037667532527,3.4532810070620572,3.4533622914700977,3.4534475226651158,3.4535366122903399,3.4536294799299396,3.4537260522302442,3.4538262621358746,3.4539300482235307,3.4540373541190927,3.4541481279860733,3.4542623220753681,3.4543798923278741,3.4545007980228251,3.4546250014658004,3.4547524677112573,{"$f":"IF(Reset=1,Vout_sync_buck,Vout_sync_buck+Iout_sync_buck*(AO132+dcr_2*10^-3))","v":3.4548831643151847},3.455017061114122,3.4551541300273003,3.4552943448791242,3.4554376812395842,3.4555841162805123,3.4557336286458709,3.4558861983344933,3.4560418065939,3.4562004358239848,3.4563620694895105,3.45652669204049,3.4566942888396266,3.4568648460960967,3.4570383508050364,3.4572147906921558,3.4573941541629933,3.4575764302563501,3.4577616086015133,3.4645877656919857]
[null,"Output Capacitor",{"$f":"ROUNDUP(MAX(Y166:Y168),0)","v":16},"Minimum output capacitance required",null,null,null,"Required Buck duty",{"$f":"IF(Reset=1,Vout_sync_buck/Vreg,I117/(I116+I117))","v":0.65492838654368157},0.65468315155328993,0.65468057075754549,0.65467964379369648,0.65468024269601599,0.65468225808029545,0.65466148916002287,0.65466685608027797,0.65467334246999465,0.65468089120785655,0.65468945210863239,0.65469898089070011,0.65470943832417539,0.65472078952359614,0.65473300335715412,0.65474605195052404,0.65475991026796609,0.65477455575693155,0.65478996804514566,0.65480612868128862,0.65482302091208566,0.65484062948993926,0.65485894050630356,0.65487794124684773,0.65489762006513663,0.65491796627210719,0.65493897003907342,0.65496062231235663,0.65498291473793602,0.65500583959477154,0.65502938973564673,0.65505355853455771,{"$f":"IF(Reset=1,Vout_sync_buck/Vreg,AO117/(AO116+AO117))","v":0.65507833983981523},0.65510372793214311,0.65512971748716353,0.65515630354173771,0.65518348146370586,0.65521124692463262,0.65523959587521252,0.6552685245230363,0.65529802931245729,0.65532810690633003,0.65535875416941813,0.65538996815329731,0.65542174608259884,0.65545408534245297,0.65548698346701484,0.65552043812896388,0.6555544471298812,0.65558900839142031,0.65562411994719638,0.65691842352900764]
[null,"ESR",{"$f":"ROUNDUP(C114/(2*C120)*1000,0)","v":68},"Maximum series equivalent resistance for output capacitor",null,null,null,"ton buck",{"$f":"I118/(fsw*10^3)*10^6","v":0.32746419327184079},0.32734157577664497,0.32734028537877274,0.32733982189684824,0.327340121348008,0.32734112904014773,0.32733074458001143,0.32733342804013899,0.32733667123499732,0.32734044560392828,0.32734472605431619,0.32734949044535006,0.32735471916208769,0.32736039476179807,0.32736650167857706,0.32737302597526202,0.32737995513398305,0.32738727787846578,0.32739498402257283,0.32740306434064431,0.32741151045604283,0.32742031474496963,0.32742947025315178,0.32743897062342386,0.32744881003256832,0.32745898313605359,0.32746948501953671,0.32748031115617832,0.32749145736896801,0.32750291979738577,0.32751469486782336,0.32752677926727886,{"$f":"AO118/(fsw*10^3)*10^6","v":0.32753916991990761},0.32755186396607155,0.32756485874358177,0.32757815177086885,0.32759174073185293,0.32760562346231631,0.32761979793760626,0.32763426226151815,0.32764901465622864,0.32766405345316502,0.32767937708470907,0.32769498407664865,0.32771087304129942,0.32772704267122649,0.32774349173350742,0.32776021906448194,0.3277772235649406,0.32779450419571016,0.32781205997359819,0.32845921176450382]
[null,"I RMS",{"$f":"ROUNDUP(IF(Topology=\"Buck\",MAX(J195:BG195),MAX(J48:BG48)),3)","v":3.6999999999999998E-2},"Maximum RMS current in output capacitor",null,null,null,"toff buck",{"$f":"1/(fsw*10^-3)-I119","v":0.17253580672815921},0.17265842422335503,0.17265971462122726,0.17266017810315176,0.172659878651992,0.17265887095985227,0.17266925541998857,0.17266657195986101,0.17266332876500268,0.17265955439607172,0.17265527394568381,0.17265050955464994,0.17264528083791231,0.17263960523820193,0.17263349832142294,0.17262697402473798,0.17262004486601695,0.17261272212153422,0.17260501597742717,0.17259693565935569,0.17258848954395717,0.17257968525503037,0.17257052974684822,0.17256102937657614,0.17255118996743168,0.17254101686394641,0.17253051498046329,0.17251968884382168,0.17250854263103199,0.17249708020261423,0.17248530513217664,0.17247322073272114,{"$f":"1/(fsw*10^-3)-AO119","v":0.17246083008009239},0.17244813603392845,0.17243514125641823,0.17242184822913115,0.17240825926814707,0.17239437653768369,0.17238020206239374,0.17236573773848185,0.17235098534377136,0.17233594654683498,0.17232062291529093,0.17230501592335135,0.17228912695870058,0.17227295732877351,0.17225650826649258,0.17223978093551806,0.1722227764350594,0.17220549580428984,0.17218794002640181,0.17154078823549618]
[null,"Actual Capacitor value =",8.5,"Enter minimum capacitance value of ceramic capacitor with tolerance & DC bias",null,null,null,"VREG_actual",{"$f":"I116*I118/(1-I118)-Iout_sync_buck*(I132+dcr_2*10^-3)","v":3.3},3.3000000000000007,3.3000000000000012,3.2999999999999994,3.3,3.3,3.3000000000000012,3.3,3.3000000000000003,3.2999999999999994,3.3000000000000007,3.2999999999999994,3.3000000000000003,3.3000000000000007,3.2999999999999994,3.3000000000000007,3.3000000000000003,3.2999999999999989,3.3000000000000007,3.3000000000000003,3.2999999999999994,3.3000000000000007,3.3000000000000007,3.3,3.3,3.3,3.3,3.3000000000000003,3.2999999999999994,3.3,3.3000000000000003,3.3000000000000003,{"$f":"AO116*AO118/(1-AO118)-Iout_sync_buck*(AO132+dcr_2*10^-3)","v":3.3000000000000012},3.3000000000000012,3.3000000000000003,3.3000000000000003,3.3000000000000007,3.3000000000000003,3.3,3.3000000000000007,3.2999999999999989,3.2999999999999989,3.3000000000000003,3.3000000000000003,3.2999999999999989,3.2999999999999989,3.3,3.2999999999999989,3.3000000000000007,3.3000000000000003,3.3000000000000003,3.3000000000000007]
[null,"Estimated ESR",3,"Enter estimated equivalent series resistance of output capacitor used",null,null,null,"Ilpk",{"$f":"Iout_sync_buck+I123/2","v":0.86339942588524943},0.86342072599607889,0.86342094997404228,0.86342103042098362,0.86342097844505439,0.86342080353780404,0.86342260588119546,0.86342214015877994,0.86342157727118118,0.86342092216349975,0.86342017917784697,0.86341935214310617,0.8634184444489813,0.86341745910747236,0.86341639880421395,0.86341526594158835,0.86341406267511966,0.86341279094434786,0.86341145249914064,0.86341004892221607,0.86340858164850154,0.86340705198183842,0.86340546110944993,0.86340381011451606,0.86340209998714046,0.8634003316339447,0.86339850588648714,0.8633966235086733,0.86339468520329499,0.86339269161781718,0.86339064334951132,0.86338854095002038,{"$f":"Iout_sync_buck+AO123/2","v":0.86338638492942854},0.86338417575989634,0.8633819138789155,0.8633795996922291,0.86337723357645624,0.8633748158814567,0.86337234693246401,0.86336982703201381,0.86336725646169021,0.86336463548370979,0.86336196434236001,0.86335924326530911,0.8633564724647983,0.86335365213873139,0.86335078247166885,0.86334786363573923,0.86334489579147267,0.86334187908856674,0.86333881366658982,0.86322533151466596]
[null,"Number of capacitors =",2,"Enter the number of parallel ceramic capacitors",null,null,null,"ΔIL",{"$f":"I116*I118/(L_buck2*10^-6*fsw*10^3)","v":0.12679885177198214},0.12684145199224556,0.12684189994817582,0.12684206084205746,0.12684195689019692,0.12684160707569614,0.12684521176247035,0.12684428031764886,0.12684315454246686,0.12684184432712609,0.12684035835585006,0.12683870428640551,0.1268368888982008,0.12683491821523563,0.12683279760877905,0.12683053188359547,0.12682812535073304,0.12682558188927121,0.12682290499894486,0.12682009784518986,0.12681716329786055,0.12681410396463899,0.12681092221997112,0.12680762023021677,0.12680419997558273,0.12680066326931133,0.12679701177451924,0.12679324701901692,0.12678937040838781,0.12678538323756131,0.12678128670107974,0.12677708190222911,0.12677276986117728,0.12676835152224511,0.12676382776041584,0.12675919938717523,0.12675446715576155,0.12674963176589396,0.12674469386803922,0.12673965406726861,0.12673451292675025,0.12672927097091699,0.12672392868834395,0.12671848653436715,0.12671294493346924,0.12670730428145743,0.1267015649474531,0.12669572727571271,0.12668979158729671,0.1266837581816003,0.12667762733776,0.12645066302933189]
[null,null,null,null,null,null,null,"IL RMS",{"$f":"SQRT((I122-I123/2)^2+I123^2/12)","v":0.80083695535756294},{"$f":"SQRT((J122-J123/2)^2+J123^2/12)","v":0.80083751753724763},0.80083752344975212,0.80083752557337295,0.8008375242013247,0.80083751958416938,0.80083756716256682,0.80083755486825836,0.8008375400090666,0.80083752271559916,0.80083750310255097,0.80083748127107546,0.80083745731073541,0.80083743130112839,0.80083740331323905,0.8008373734105787,0.80083734165014442,0.80083730808323494,0.80083727275614491,0.8008372357107586,0.80083719698506162,0.80083715661358168,0.80083711462777063,0.80083707105633528,0.80083702592552874,0.800836979259402,0.80083693108002729,0.80083688140769294,0.80083683026107633,0.80083677765739691,0.80083672361255143,0.800836668141234,0.80083661125704453,0.80083655297258405,0.80083649329954032,0.80083643224876633,0.80083636983034745,0.80083630605366618,0.80083624092745676,0.80083617445985678,0.80083610665845306,0.80083603753032395,0.80083596708207661,0.80083589531988242,0.80083582224950733,0.80083574787634226,0.80083567220542751,0.80083559524147818,0.80083551698890598,0.80083543745183861,0.80083535663413963,0.80083236750794473]
[null," Compensation Components, Adjustable Buck:",null,null,null,null,null,"I_hi_sw buck RMS",{"$f":"SQRT(I118*((I122-I123/2)^2+I123^2/12))","v":0.64809849519701801},0.64797759992565918,0.64797632752729384,0.64797587050975425,0.64797616578437733,0.64797715942089629,0.64796691973062437,0.64796956579673326,0.64797276378266522,0.6479764855176271,0.64798070624977555,0.64798540413729055,0.64799055982846077,0.64799615611302341,0.64800217763094614,0.64800861062784032,0.64801544274845913,0.64802266286150279,0.64803026091028648,0.64803822778490316,0.64804655521233157,0.64805523566160139,0.64806426226164759,0.64807362872990526,0.64808332931003498,0.64809335871743212,0.64810371209140794,0.64811438495310014,0.64812537316832441,0.6481366729147009,0.64814828065248731,0.6481601930986407,0.64817240720369451,0.64818492013109985,0.64819772923872887,0.64821083206227947,0.64822422630035503,0.64823790980102736,0.64825188054970972,0.6482661366581941,0.64828067635472497,0.64829549797499497,0.64831059995396367,0.64832598081841386,0.6483416391801694,0.64835757372990299,0.64837378323147898,0.64839026651677656,0.64840702248094395,0.64842405007804582,0.6484413483170639,0.64907867187026358]
[null,"fcMAX",{"$f":"ROUNDDOWN(fsw/22,0)","v":90},"Recommended maximum 0dB crossover frequency",null,null,null,"I_lo_sw buck RMS",{"$f":"SQRT((1-I118)*((I122-I123/2)^2+I123^2/12))","v":0.47043402256823669},{"$f":"SQRT((1-J118)*((J122-J123/2)^2+J123^2/12))","v":0.47060148691839454},0.47060324895751993,0.470603881840778,0.47060347294116367,0.47060209693811539,0.47061627671986156,0.47061261254726666,0.47060818403808896,0.47060303017031485,0.47059718518449556,0.47059067928894666,0.4705835392415697,0.47057578883293155,0.47056744928973054,0.47055853961364974,0.47054907686742781,0.47053907641755893,0.47052855214114908,0.47051751660299651,0.47050598120780662,0.47049395633154811,0.47048145143522868,0.47046847516379098,0.47045503543236378,0.47044113950172523,0.47042679404452914,0.47041200520359161,0.47039677864333651,0.47038111959531825,0.47036503289861015,0.47034852303572283,0.47033159416462211,0.47031425014733508,0.47029649457556055,0.47027833079364834,0.47025976191925578,0.47024079086195442,0.47022142034001874,0.47020165289560367,0.47018149090848893,0.47016093660854436,0.47013999208705559,0.47011865930702978,0.47009694011258535,0.47007483623752283,0.47005234931315676,0.47002948087548324,0.47000623237174727,0.46998260516646956,0.46995860054698196,0.46907287128069419]
[null,"fc =",45,"Choose fc considering recommended fcMAX",null,null,null,"I cout RMS",{"$f":"SQRT(((I122-I123/2-Iout_sync_buck)^2+I123^2/12))","v":3.660367560174467E-2},3.6615973226062984E-2,3.6616102539801444E-2,3.6616148985864377E-2,3.6616118977547046E-2,3.6616017994798952E-2,3.6617058578238666E-2,3.6616789693279458E-2,3.6616464709977273E-2,3.6616086483387426E-2,3.6615657520429314E-2,3.6615180031709778E-2,3.6614655974275441E-2,3.6614087087105229E-2,3.6613474920750955E-2,3.6612820862228633E-2,3.6612126156030655E-2,3.6611391921950828E-2,3.6610619170275575E-2,3.6609808814787523E-2,3.6608961683942259E-2,3.6608078530512754E-2,3.6607160039942507E-2,3.6606206837605744E-2,3.6605219495138917E-2,3.6604198535979994E-2,3.660314444022942E-2,3.6602057648928064E-2,3.6600938567832933E-2,3.6599787570757943E-2,3.6598605002537754E-2,3.6597391181663601E-2,3.659614640263259E-2,3.6594870938046656E-2,3.6593565040491716E-2,3.659222894422353E-2,3.6590862866683255E-2,3.658946700986241E-2,3.6588041561534577E-2,3.6586586696368786E-2,3.6585102576937679E-2,3.6583589354631976E-2,3.6582047170491155E-2,3.658047615595942E-2,3.6578876433574346E-2,3.6577248117595634E-2,3.657559131457945E-2,3.6573906123904071E-2,3.657219263825167E-2,3.6570450944050197E-2,3.6568681121879415E-2,3.6503162169595711E-2]
[null,"R_LOADTYP",{"$f":"Vout_sync_buck/Iout_sync_buck","v":4.1249999999999991},null,null,null,"Adj BUCK High Side FET","Rds_On Buck",{"$f":"Buck_RdsON_factor_7V*(I89-150)+Adj_buck_hi_rdsON_150","v":0.2876153882958063},0.28599867661518291,0.28598166271928455,0.28597555171013367,0.28597949997368988,0.28599278639456976,0.28585586728765894,0.28589124870948152,0.28593401023374709,0.28598377528818247,0.28604021302665356,0.28610303152257155,0.28617197215292473,0.28624680493530819,0.28632732463327765,0.28641334748534319,0.28650470844339315,0.28660125882975035,0.2867028643401901,0.28680940333438931,0.28692076536638228,0.28703684991637957,0.28715756529229192,0.2872828276748936,0.28741256028505668,0.287546692655131,0.28768515998950406,0.28782790260179442,0.28797486541812056,0.28812599753752255,0.2882812518419734,0.28844058464954186,{"$f":"Buck_RdsON_factor_7V*(AO89-150)+Adj_buck_hi_rdsON_150","v":0.28860395540521289},0.28877132640465836,0.28894266254691559,0.28911793111248862,0.28929710156386379,0.28948014536583,0.28966703582333858,0.2898577479349298,0.29005225826000319,0.29025054479842449,0.29045258688114683,0.29065836507068443,0.29086786107041579,0.29108105764181141,0.29129793852878899,0.29151848838848671,0.29174269272782666,0.2919705378453098,0.29220201077754415,0.30073470711498251,null,"V5 LDO"]
[null,"fP1",{"$f":"wp_adj/(2*PI())","v":2.7040246956941218},"Dominant pole formed by Co and RLOAD.",null,null,null,"Conduction Losses",{"$f":"I125^2*I128","v":0.12080756883690547},{"$f":"J125^2*J128","v":0.12008368576538905},0.12007607048127424,0.12007333525600214,0.12007510245761102,0.12008104934327007,0.12001976718930657,0.12003560283231171,0.1200547419072439,0.12007701604720418,0.12010227736742418,0.1201303954163478,0.12016125466019557,0.12019475239451129,0.12023079699992432,0.12026930647729291,0.12031020721104749,0.12035343292005488,0.12039892376343855,0.12044662557513602,0.1204964892059455,0.12054846995575125,0.1206025270817464,0.12065862337097726,0.12071672476755003,0.12077680004646886,0.12083882052740519,0.12090275982277787,0.1209685936154164,0.12103629946181169,0.12110585661756706,0.1211772458821674,0.12125044946060573,0.12132545083976,0.12140223467770991,0.1214807867044336,0.1215610936325366,0.12164314307684627,0.12172692348185583,0.12181242405613592,0.12189963471294242,0.12198854601634536,0.12207914913228693,0.12217143578404915,0.1222653982116733,0.12236102913492475,0.12245832171944812,0.12255726954579467,0.12265786658103991,0.12276010715274303,0.12286398592502401,0.12670047108456076]
[null,"fZ1",{"$f":"wz_adj/(2*PI())","v":6241.3703173292288},"Zero formed by the output capacitance and its ESR",null,null,null,"Switching Losses",{"$f":"0.5*Vreg*Iout_sync_buck*fsw*10^3*(Vreg/SLEW_rate+Vreg/1.5)*10^-9","v":4.0707555555555545E-2},4.0707555555555545E-2,4.0707555555555545E-2,4.0707555555555545E-2,4.0707555555555545E-2,4.0707555555555545E-2,4.0707555555555545E-2,4.0707555555555545E-2,4.0707555555555545E-2,4.0707555555555545E-2,4.0707555555555545E-2,4.0707555555555545E-2,4.0707555555555545E-2,4.0707555555555545E-2,4.0707555555555545E-2,4.0707555555555545E-2,4.0707555555555545E-2,4.0707555555555545E-2,4.0707555555555545E-2,4.0707555555555545E-2,4.0707555555555545E-2,4.0707555555555545E-2,4.0707555555555545E-2,4.0707555555555545E-2,4.0707555555555545E-2,4.0707555555555545E-2,4.0707555555555545E-2,4.0707555555555545E-2,4.0707555555555545E-2,4.0707555555555545E-2,4.0707555555555545E-2,4.0707555555555545E-2,4.0707555555555545E-2,4.0707555555555545E-2,4.0707555555555545E-2,4.0707555555555545E-2,4.0707555555555545E-2,4.0707555555555545E-2,4.0707555555555545E-2,4.0707555555555545E-2,4.0707555555555545E-2,4.0707555555555545E-2,4.0707555555555545E-2,4.0707555555555545E-2,4.0707555555555545E-2,4.0707555555555545E-2,4.0707555555555545E-2,4.0707555555555545E-2,4.0707555555555545E-2,4.0707555555555545E-2,4.0707555555555545E-2,4.0707555555555545E-2]
[null,"fP2",{"$f":"IF(fz_1_2>10*fc_2,MAX(fsw/2,5*fc_2),fz_1_2)","v":1000},null,null,null,null,"Total Buck FET Losses",{"$f":"I129+I130","v":0.16151512439246102},{"$f":"J129+J130","v":0.16079124132094461},0.16078362603682977,0.16078089081155769,0.16078265801316657,0.16078860489882563,0.16072732274486212,0.16074315838786726,0.16076229746279944,0.16078457160275972,0.16080983292297973,0.16083795097190334,0.16086881021575111,0.16090230795006683,0.16093835255547986,0.16097686203284844,0.16101776276660304,0.16106098847561043,0.16110647931899411,0.16115418113069158,0.16120404476150105,0.1612560255113068,0.16131008263730195,0.16136617892653279,0.16142428032310557,0.1614843556020244,0.16154637608296074,0.16161031537833342,0.16167614917097195,0.16174385501736724,0.16181341217312262,0.16188480143772294,0.16195800501616128,0.16203300639531554,0.16210979023326547,0.16218834225998915,0.16226864918809214,0.16235069863240181,0.16243447903741137,0.16251997961169146,0.16260719026849796,0.1626961015719009,0.16278670468784248,0.16287899133960471,0.16297295376722884,0.1630685846904803,0.16316587727500367,0.16326482510135021,0.16336542213659547,0.16346766270829857,0.16357154148057956,0.16740802664011631]
[null,"Rz",{"$f":"fc_2*10^3*Vout_sync_buck/VFB_adj*2*PI()*Number_Cout2*Co_2*10^-6/(gm_POWER2*gm_EA2*10^-6)*10^-3","v":10.574600871983241},"Recommended compensation resister to achieve chosen fc",null,null,"Adj BUCK Low Side FET","Rds_On Buck",{"$f":"Buck_RdsON_factor_7V*(I89-150)+Adj_buck_lo_rdsON_150","v":9.7615388295806321E-2},9.5998676615182937E-2,9.5981662719284572E-2,9.5975551710133652E-2,9.5979499973689902E-2,9.5992786394569762E-2,9.5855867287658936E-2,9.5891248709481527E-2,9.5934010233747091E-2,9.5983775288182499E-2,9.6040213026653568E-2,9.6103031522571589E-2,9.6171972152924709E-2,9.6246804935308183E-2,9.6327324633277658E-2,9.641334748534322E-2,9.6504708443393192E-2,9.6601258829750361E-2,9.6702864340190084E-2,9.680940333438931E-2,9.6920765366382319E-2,9.7036849916379564E-2,9.7157565292291942E-2,9.7282827674893602E-2,9.7412560285056668E-2,9.7546692655131023E-2,9.7685159989504056E-2,9.7827902601794414E-2,9.797486541812056E-2,9.8125997537522588E-2,9.8281251841973422E-2,9.8440584649541876E-2,{"$f":"Buck_RdsON_factor_7V*(AO89-150)+Adj_buck_lo_rdsON_150","v":9.8603955405212884E-2},9.8771326404658383E-2,9.8942662546915583E-2,9.9117931112488622E-2,9.9297101563863802E-2,9.9480145365830025E-2,9.9667035823338579E-2,9.9857747934929797E-2,0.10005225826000323,0.10025054479842452,0.10045258688114683,0.10065836507068447,0.10086786107041579,0.10108105764181141,0.10129793852878902,0.10151848838848671,0.10174269272782664,0.10197053784530982,0.10220201077754419,0.11073470711498254,null,"Buck Diode"]
[null,"Actual Rz used = ",10,"Enter the closest available 1% standard resister value",null,null,null,"Conduction Losses",{"$f":"I126^2*I132","v":2.1603082907535869E-2},{"$f":"J126^2*J132","v":2.1260419826597564E-2},2.1256811011007962E-2,2.1255514791753752E-2,2.1256352267235226E-2,2.1259170458937951E-2,2.1230126804717482E-2,2.1237632358552069E-2,2.1246703147167031E-2,2.1257259110834485E-2,2.1269229873218026E-2,2.1282553299983967E-2,2.1297174309382109E-2,2.1313043884538262E-2,2.1330118248392104E-2,2.1348358170670718E-2,2.136772838273068E-2,2.1388197081053693E-2,2.1409735504014597E-2,2.1432317569532108E-2,2.1455919563562086E-2,2.1480519871251637E-2,2.1506098744050309E-2,2.153263809725817E-2,2.1560121333443105E-2,2.158853318793013E-2,2.1617859593192727E-2,2.1648087559488039E-2,2.1679205069499188E-2,2.1711200985093854E-2,2.1744064964596709E-2,2.1777787389211267E-2,2.1812359297426642E-2,2.1847772326411788E-2,2.1884018659539952E-2,2.1921090979305106E-2,2.1958982424992068E-2,2.1997686554547466E-2,2.2037197310170991E-2,2.2077508987208869E-2,2.211861620598413E-2,2.2160513886243939E-2,2.2203197223943847E-2,2.2246661670122389E-2,2.2290902911648921E-2,2.2335916853653225E-2,2.2381699603467295E-2,2.2428247455929171E-2,2.2475556879915471E-2,2.2523624505984229E-2,2.2572447115022119E-2,2.4364886578114153E-2]
[null,"Cz (min)",{"$f":"MIN(4*1000000000/(6.28*Rz_adj*1000*fc_2*1000),1000000000/(6.28*Rz_adj*1000*1.5*fp_1_2*1000))","v":1.4154281670205235},"Recommended range for the compensation capacitor",null,null,null,"Body Diode Losses",{"$f":"(I122-I123/2)*(2*td*10^-9*(fsw*10^3))*0.05","v":2.3999999999977754E-3},2.3999999999998688E-3,2.3999999999998636E-3,2.3999999999998649E-3,2.3999999999998684E-3,2.3999999999998684E-3,2.3999999999998814E-3,2.3999999999998671E-3,2.3999999999998437E-3,2.3999999999998107E-3,2.399999999999766E-3,2.399999999999711E-3,2.3999999999996433E-3,2.3999999999995639E-3,2.3999999999994737E-3,2.3999999999993723E-3,2.3999999999992599E-3,2.3999999999991372E-3,2.3999999999990049E-3,2.3999999999988635E-3,2.3999999999987139E-3,2.3999999999985569E-3,2.3999999999983934E-3,2.399999999998223E-3,2.3999999999980478E-3,2.3999999999978674E-3,2.3999999999976831E-3,2.3999999999974948E-3,2.3999999999973036E-3,2.3999999999971097E-3,2.3999999999969146E-3,2.3999999999967177E-3,{"$f":"(AO122-AO123/2)*(2*td*10^-9*(fsw*10^3))*0.05","v":2.3999999999965199E-3},2.3999999999963217E-3,2.3999999999961227E-3,2.3999999999959245E-3,2.3999999999957267E-3,2.3999999999955294E-3,2.3999999999953334E-3,2.3999999999951391E-3,2.3999999999949457E-3,2.3999999999947544E-3,2.3999999999945645E-3,2.3999999999943771E-3,2.3999999999941915E-3,2.3999999999940081E-3,2.3999999999938272E-3,2.399999999993649E-3,2.3999999999934733E-3,2.3999999999932999E-3,2.3999999999931299E-3,2.4000000000000007E-3]
[null,"Cz (max)",{"$f":"MAX(4*1000000000/(6.28*Rz_adj*1000*fc_2*1000),1000000000/(6.28*Rz_adj*1000*1.5*fp_1_2*1000))","v":3.9258928624277516},null,null,null,null,"Total Buck FET Losses",{"$f":"I133+I134","v":2.4003082907533644E-2},{"$f":"J133+J134","v":2.3660419826597431E-2},2.3656811011007826E-2,2.3655514791753617E-2,2.3656352267235094E-2,2.3659170458937819E-2,2.3630126804717363E-2,2.3637632358551937E-2,2.3646703147166874E-2,2.3657259110834297E-2,2.3669229873217793E-2,2.3682553299983679E-2,2.3697174309381751E-2,2.3713043884537828E-2,2.373011824839158E-2,2.374835817067009E-2,2.376772838272994E-2,2.3788197081052828E-2,2.38097355040136E-2,2.3832317569530973E-2,2.3855919563560798E-2,2.3880519871250193E-2,2.3906098744048702E-2,2.3932638097256393E-2,2.3960121333441151E-2,2.3988533187927999E-2,2.4017859593190409E-2,2.4048087559485534E-2,2.4079205069496491E-2,2.4111200985090963E-2,2.4144064964593624E-2,2.4177787389207984E-2,2.4212359297423162E-2,2.424777232640811E-2,2.4284018659536076E-2,2.4321090979301033E-2,2.4358982424987796E-2,2.4397686554542997E-2,2.4437197310166324E-2,2.4477508987204008E-2,2.4518616205979074E-2,2.4560513886238693E-2,2.460319722393841E-2,2.4646661670116768E-2,2.4690902911643112E-2,2.4735916853647233E-2,2.4781699603461122E-2,2.4828247455922822E-2,2.4875556879908944E-2,2.4923624505977529E-2,2.4972447115015249E-2,2.6764886578114152E-2]
[null,"Cp",{"$f":"MAX(1/(2*PI()*Rz_adj*10^3*fz_1_2*10^3)*10^12, 1/(2*PI()*Rz_adj*10^3*fsw/2*10^3)*10^12, 1/(2*PI()*Rz_adj*10^3*15*fc_2*10^3)*10^12)","v":23.578510087688201},"Recommended HF compensation capacitor",null,null,"V5A LDO","Output voltage",{"$f":"IF(I99-5<I137*Iout_V5A,I99-I137*Iout_V5A,5)","v":5},5,5,5,5,5,5,5,5,5,5,5,5,5,5,5,5,5,5,5,5,5,5,5,5,5,5,5,5,5,5,5,{"$f":"IF(AO99-5<AO137*Iout_V5A,AO99-AO137*Iout_V5A,5)","v":5},5,5,5,5,5,5,5,5,5,5,5,5,5,5,5,5,5,5,5]
[null,"Actual Cz used =",1.5,"Enter actual Cp used",null,null,null,"Series pass resistance",{"$f":"(Rds_ON_V5A_150-Rds_ON_V5A_min40)/190*(I89-150)+Rds_ON_V5A_150","v":0.6606358288019657},0.65562769409619248,0.65557498965695926,0.65555605940651152,0.65556829005714679,0.65560944778880748,0.65518530949660492,0.65529491155409803,0.65542737516917093,0.65558153382296169,0.65575636264379589,0.65595095732220532,0.65616451671417808,0.65639632839654294,0.65664575660240831,0.65691223208847205,0.65719524358040748,0.6574943305150579,0.65780907685432777,0.65813910578945711,0.65848407518877172,0.6588436736692016,0.65921761719350025,0.65960564611241879,0.66000752258502382,0.6604230283216298,0.66085196260298673,0.66129414053685831,0.6617493915192828,0.66221755787287939,0.66269849363876754,0.66319206350216098,{"$f":"(Rds_ON_V5A_150-Rds_ON_V5A_min40)/190*(AO89-150)+Rds_ON_V5A_150","v":0.66369814183461218},0.6642166118383297,0.66474736478004204,0.66529029930361705,0.66584532081211212,0.66641234091117529,0.6669912769067794,0.66758205135117688,0.66818459163173938,0.66879882959801207,0.66942470122288833,0.67006214629430472,0.67071110813428503,0.67137153334253652,0.67204337156212102,0.67272657526500967,0.67342109955557483,0.67412690199028513,0.67484394241206458,0.70127592355843171]
[null,"Actual Cp used =",39,"Enter actual Cz used",null,null,null,"Dropout",{"$f":"I99-I136","v":0.34999999999999964},0.35000000000000053,0.35000000000000053,0.34999999999999964,0.34999999999999964,0.34999999999999964,0.34999999999999964,0.34999999999999964,0.34999999999999964,0.34999999999999964,0.35000000000000053,0.34999999999999964,0.34999999999999964,0.34999999999999876,0.34999999999999964,0.34999999999999964,0.35000000000000053,0.34999999999999876,0.35000000000000053,0.34999999999999876,0.34999999999999964,0.35000000000000142,0.35000000000000053,0.34999999999999964,0.35000000000000142,0.35000000000000053,0.34999999999999876,0.34999999999999876,0.34999999999999964,0.34999999999999964,0.34999999999999964,0.34999999999999964,{"$f":"AO99-AO136","v":0.35000000000000053},0.34999999999999964,0.35000000000000053,0.34999999999999964,0.34999999999999964,0.35000000000000053,0.35000000000000053,0.34999999999999964,0.34999999999999876,0.35000000000000053,0.35000000000000053,0.35000000000000142,0.34999999999999964,0.34999999999999964,0.34999999999999964,0.35000000000000053,0.34999999999999964,0.35000000000000053,0.34999999999999964,0.34999999999999964]
[null,"Estimated cross over",{"$f":"'Control Loop2'!$B$21","v":42.292428743894995},null,null,null,null,"Power dissipated",{"$f":"(I99-I136)*Iout_V5A","v":0},0,0,0,0,0,0,0,0,0,0,0,0,0,0,0,0,0,0,0,0,0,0,0,0,0,0,0,0,0,0,0,{"$f":"(AO99-AO136)*Iout_V5A","v":0},0,0,0,0,0,0,0,0,0,0,0,0,0,0,0,0,0,0,0]
[null,"Estimated phase margin",{"$f":"'Control Loop2'!$B$22","v":68.915645666888111},null,null,null,"V5B LDO","Output voltage",{"$f":"IF(I99-5<I141*Iout_V5B,I99-I141*Iout_V5B,5)","v":5},5,5,5,5,5,5,5,5,5,5,5,5,5,5,5,5,5,5,5,5,5,5,5,5,5,5,5,5,5,5,5,{"$f":"IF(AO99-5<AO141*Iout_V5B,AO99-AO141*Iout_V5B,5)","v":5},5,5,5,5,5,5,5,5,5,5,5,5,5,5,5,5,5,5,5]
[null,null,null,null,null,null,null,"Series pass resistance",{"$f":"(Rds_ON_V5B_150-Rds_ON_V5B_min40)/190*(I89-150)+Rds_ON_V5B_150","v":0.6606358288019657},0.65562769409619248,0.65557498965695926,0.65555605940651152,0.65556829005714679,0.65560944778880748,0.65518530949660492,0.65529491155409803,0.65542737516917093,0.65558153382296169,0.65575636264379589,0.65595095732220532,0.65616451671417808,0.65639632839654294,0.65664575660240831,0.65691223208847205,0.65719524358040748,0.6574943305150579,0.65780907685432777,0.65813910578945711,0.65848407518877172,0.6588436736692016,0.65921761719350025,0.65960564611241879,0.66000752258502382,0.6604230283216298,0.66085196260298673,0.66129414053685831,0.6617493915192828,0.66221755787287939,0.66269849363876754,0.66319206350216098,{"$f":"(Rds_ON_V5B_150-Rds_ON_V5B_min40)/190*(AO89-150)+Rds_ON_V5B_150","v":0.66369814183461218},0.6642166118383297,0.66474736478004204,0.66529029930361705,0.66584532081211212,0.66641234091117529,0.6669912769067794,0.66758205135117688,0.66818459163173938,0.66879882959801207,0.66942470122288833,0.67006214629430472,0.67071110813428503,0.67137153334253652,0.67204337156212102,0.67272657526500967,0.67342109955557483,0.67412690199028513,0.67484394241206458,0.70127592355843171]
[null,null,null,null,null,null,null,"Dropout",{"$f":"I99-I140","v":0.34999999999999964},0.35000000000000053,0.35000000000000053,0.34999999999999964,0.34999999999999964,0.34999999999999964,0.34999999999999964,0.34999999999999964,0.34999999999999964,0.34999999999999964,0.35000000000000053,0.34999999999999964,0.34999999999999964,0.34999999999999876,0.34999999999999964,0.34999999999999964,0.35000000000000053,0.34999999999999876,0.35000000000000053,0.34999999999999876,0.34999999999999964,0.35000000000000142,0.35000000000000053,0.34999999999999964,0.35000000000000142,0.35000000000000053,0.34999999999999876,0.34999999999999876,0.34999999999999964,0.34999999999999964,0.34999999999999964,0.34999999999999964,{"$f":"AO99-AO140","v":0.35000000000000053},0.34999999999999964,0.35000000000000053,0.34999999999999964,0.34999999999999964,0.35000000000000053,0.35000000000000053,0.34999999999999964,0.34999999999999876,0.35000000000000053,0.35000000000000053,0.35000000000000142,0.34999999999999964,0.34999999999999964,0.34999999999999964,0.35000000000000053,0.34999999999999964,0.35000000000000053,0.34999999999999964,0.34999999999999964]
[null,null,null,null,null,null,null,"Power dissipated",{"$f":"(I99-I140)*Iout_V5B","v":0},0,0,0,0,0,0,0,0,0,0,0,0,0,0,0,0,0,0,0,0,0,0,0,0,0,0,0,0,0,0,0,{"$f":"(AO99-AO140)*Iout_V5B","v":0},0,0,0,0,0,0,0,0,0,0,0,0,0,0,0,0,0,0,0]
[null,null,null,null,null,null,"V5CAN LDO","Output voltage",{"$f":"IF(I99-5<I145*Iout_V5CAN,I99-I145*Iout_sync_buck,5)","v":5},5,5,5,5,5,5,5,5,5,5,5,5,5,5,5,5,5,5,5,5,5,5,5,5,5,5,5,5,5,5,5,{"$f":"IF(AO99-5<AO145*Iout_V5CAN,AO99-AO145*Iout_sync_buck,5)","v":5},5,5,5,5,5,5,5,5,5,5,5,5,5,5,5,5,5,5,5]
[null,null,null,null,null,null,null,"Series pass resistance",{"$f":"(Rds_ON_V5CAN_150-Rds_ON_V5CAN_min40)/190*(I89-150)+Rds_ON_V5CAN_150","v":0.48102505625361069},0.4781564036802079,0.47812621465093486,0.47811537142988503,0.47812237712950778,0.47814595222079037,0.47790300639866562,0.47796578630430897,0.47804166127824355,0.47812996314009232,0.47823010484478984,0.47834156840513414,0.47846389492695296,0.47859667633524738,0.47873954846362882,0.47889218525032795,0.47905429383812359,0.479225610417082,0.47940589668116251,0.47959493679483289,0.47979253478554756,0.47999851229351825,0.48021270662260657,0.48043496904608474,0.48066516332899795,0.48090316443531889,0.48114885739334112,0.48140213629704964,0.48166290342473311,0.48193106845900763,0.48220654779483024,0.48248926392408004,{"$f":"(Rds_ON_V5CAN_150-Rds_ON_V5CAN_min40)/190*(AO89-150)+Rds_ON_V5CAN_150","v":0.4827791448869575},0.48307612378185061,0.48338013832649318,0.48369113046423406,0.48400904601007644,0.48433383433185895,0.48466544806255807,0.48500384284021208,0.4853489770724087,0.48570081172266255,0.48605931011633624,0.48642443776404376,0.48679616220071953,0.48717445283875027,0.487559280833752,0.48795061896173619,0.48834844150654988,0.48875272415659748,0.48916344390996203,0.50430364583948528]
[null,null,null,null,null,null,null,"Dropout",{"$f":"I99-I144","v":0.34999999999999964},0.35000000000000053,0.35000000000000053,0.34999999999999964,0.34999999999999964,0.34999999999999964,0.34999999999999964,0.34999999999999964,0.34999999999999964,0.34999999999999964,0.35000000000000053,0.34999999999999964,0.34999999999999964,0.34999999999999876,0.34999999999999964,0.34999999999999964,0.35000000000000053,0.34999999999999876,0.35000000000000053,0.34999999999999876,0.34999999999999964,0.35000000000000142,0.35000000000000053,0.34999999999999964,0.35000000000000142,0.35000000000000053,0.34999999999999876,0.34999999999999876,0.34999999999999964,0.34999999999999964,0.34999999999999964,0.34999999999999964,{"$f":"AO99-AO144","v":0.35000000000000053},0.34999999999999964,0.35000000000000053,0.34999999999999964,0.34999999999999964,0.35000000000000053,0.35000000000000053,0.34999999999999964,0.34999999999999876,0.35000000000000053,0.35000000000000053,0.35000000000000142,0.34999999999999964,0.34999999999999964,0.34999999999999964,0.35000000000000053,0.34999999999999964,0.35000000000000053,0.34999999999999964,0.34999999999999964]
[null,null,null,null,null,null,null,"Power dissipated",{"$f":"(I99-I144)*Iout_V5CAN","v":0},0,0,0,0,0,0,0,0,0,0,0,0,0,0,0,0,0,0,0,0,0,0,0,0,0,0,0,0,0,0,0,{"$f":"(AO99-AO144)*Iout_V5CAN","v":0},0,0,0,0,0,0,0,0,0,0,0,0,0,0,0,0,0,0,0]
[null,null,null,null,null,null,"V5P LDO","Output voltage",{"$f":"IF(I99-5<I149*Iout_V5P,I99-I149*Iout_V5P,5)","v":5},5,5,5,5,5,5,5,5,5,5,5,5,5,5,5,5,5,5,5,5,5,5,5,5,5,5,5,5,5,5,5,{"$f":"IF(AO99-5<AO149*Iout_V5P,AO99-AO149*Iout_V5P,5)","v":5},5,5,5,5,5,5,5,5,5,5,5,5,5,5,5,5,5,5,5,"Output voltage"]
[null,null,null,null,null,null,null,"Series pass resistance",{"$f":"(Rds_ON_V5P_150-Rds_ON_V5P_min40)/190*(I89-150)+Rds_ON_V5P_150","v":0.6606358288019657},0.65562769409619248,0.65557498965695926,0.65555605940651152,0.65556829005714679,0.65560944778880748,0.65518530949660492,0.65529491155409803,0.65542737516917093,0.65558153382296169,0.65575636264379589,0.65595095732220532,0.65616451671417808,0.65639632839654294,0.65664575660240831,0.65691223208847205,0.65719524358040748,0.6574943305150579,0.65780907685432777,0.65813910578945711,0.65848407518877172,0.6588436736692016,0.65921761719350025,0.65960564611241879,0.66000752258502382,0.6604230283216298,0.66085196260298673,0.66129414053685831,0.6617493915192828,0.66221755787287939,0.66269849363876754,0.66319206350216098,{"$f":"(Rds_ON_V5P_150-Rds_ON_V5P_min40)/190*(AO89-150)+Rds_ON_V5P_150","v":0.66369814183461218},0.6642166118383297,0.66474736478004204,0.66529029930361705,0.66584532081211212,0.66641234091117529,0.6669912769067794,0.66758205135117688,0.66818459163173938,0.66879882959801207,0.66942470122288833,0.67006214629430472,0.67071110813428503,0.67137153334253652,0.67204337156212102,0.67272657526500967,0.67342109955557483,0.67412690199028513,0.67484394241206458,0.70127592355843171,"Series pass resistance"]
[null,null,null,null,null,null,null,"Dropout",{"$f":"I99-I148","v":0.34999999999999964},0.35000000000000053,0.35000000000000053,0.34999999999999964,0.34999999999999964,0.34999999999999964,0.34999999999999964,0.34999999999999964,0.34999999999999964,0.34999999999999964,0.35000000000000053,0.34999999999999964,0.34999999999999964,0.34999999999999876,0.34999999999999964,0.34999999999999964,0.35000000000000053,0.34999999999999876,0.35000000000000053,0.34999999999999876,0.34999999999999964,0.35000000000000142,0.35000000000000053,0.34999999999999964,0.35000000000000142,0.35000000000000053,0.34999999999999876,0.34999999999999876,0.34999999999999964,0.34999999999999964,0.34999999999999964,0.34999999999999964,{"$f":"AO99-AO148","v":0.35000000000000053},0.34999999999999964,0.35000000000000053,0.34999999999999964,0.34999999999999964,0.35000000000000053,0.35000000000000053,0.34999999999999964,0.34999999999999876,0.35000000000000053,0.35000000000000053,0.35000000000000142,0.34999999999999964,0.34999999999999964,0.34999999999999964,0.35000000000000053,0.34999999999999964,0.35000000000000053,0.34999999999999964,0.34999999999999964,"Dropout"]
[null,null,null,null,null,null,null,"Power dissipated",{"$f":"(I99-I148)*Iout_V5P","v":2.6249999999999971E-2},2.6250000000000041E-2,2.6250000000000041E-2,2.6249999999999971E-2,2.6249999999999971E-2,2.6249999999999971E-2,2.6249999999999971E-2,2.6249999999999971E-2,2.6249999999999971E-2,2.6249999999999971E-2,2.6250000000000041E-2,2.6249999999999971E-2,2.6249999999999971E-2,2.6249999999999905E-2,2.6249999999999971E-2,2.6249999999999971E-2,2.6250000000000041E-2,2.6249999999999905E-2,2.6250000000000041E-2,2.6249999999999905E-2,2.6249999999999971E-2,2.6250000000000107E-2,2.6250000000000041E-2,2.6249999999999971E-2,2.6250000000000107E-2,2.6250000000000041E-2,2.6249999999999905E-2,2.6249999999999905E-2,2.6249999999999971E-2,2.6249999999999971E-2,2.6249999999999971E-2,2.6249999999999971E-2,{"$f":"(AO99-AO148)*Iout_V5P","v":2.6250000000000041E-2},2.6249999999999971E-2,2.6250000000000041E-2,2.6249999999999971E-2,2.6249999999999971E-2,2.6250000000000041E-2,2.6250000000000041E-2,2.6249999999999971E-2,2.6249999999999905E-2,2.6250000000000041E-2,2.6250000000000041E-2,2.6250000000000107E-2,2.6249999999999971E-2,2.6249999999999971E-2,2.6249999999999971E-2,2.6250000000000041E-2,2.6249999999999971E-2,2.6250000000000041E-2,2.6249999999999971E-2,2.6249999999999971E-2,"Power dissipated"]
[null,null,null,null,null,null,"Buck Diode","Tj Diode",{"$f":"I155*RTHavg_Vd+Ta","v":138.97245731573082},{"$f":"J155*RTHavg_Vd+Ta","v":126.70150998272752},127.68868809016799,128.59750560950712,129.43690589425432,130.21452541980315,130.97308758623299,131.64348372001723,132.26948003745341,132.85533573084285,133.40478330406077,133.9211073732553,134.40720975901655,134.86566356858941,135.29875837730344,135.70853816971515,136.09683335669604,136.46528791858015,136.81538251731288,137.14845425818044,137.46571365364457,137.7682592402015,138.05709021809935,138.33311741868843,138.59717285170288,138.85001804223467,139.09235133251988,139.324814295312,139.5479973823289,139.76244491204324,139.96865948516577,140.16710590293366,140.35821465226439,{"$f":"AP155*RTHavg_Vd+Ta","v":140.54238501258243},140.71998783134475,140.89136800873393,141.05684672643753,141.21672345072579,141.37127773603336,141.52077085183268,141.66544725266058,141.80553590865151,141.94125151177028,142.07279557107788,142.20035740875312,142.32411506720078,142.44423613636559,142.56087850931885,142.67419107326612,142.78431434232189,142.89138103769486,146.73379419998466,"Tj Diode"]
[null,null,null,null,null,null,null,"I Buck Diode ON",{"$f":"I102-I103/2","v":0.66553875753623959},0.66553875755902658,0.66553875755902892,0.66553875755903302,0.66553875755903447,0.66553875755902892,0.66553875755901792,0.66553875755898007,0.66553875755891434,0.66553875755880931,0.66553875755865144,0.6655387575584254,0.66553875755811387,0.66553875755769865,0.66553875755716041,0.6655387575564794,0.6655387575556363,0.66553875755461145,0.66553875755338654,0.66553875755194358,0.66553875755026615,0.66553875754833913,0.66553875754614822,0.66553875754368153,0.66553875754092806,0.66553875753787817,0.66553875753452418,0.66553875753085989,0.6655387575268803,0.66553875752258185,0.66553875751796199,0.66553875751301983,{"$f":"AO102-AO103/2","v":0.66553875750775549},0.66553875750216973,0.66553875749626468,0.6655387574900431,0.66553875748350877,0.66553875747666591,0.66553875746951952,0.6655387574620748,0.66553875745433833,0.66553875744631585,0.66553875743801438,0.66553875742944091,0.66553875742060276,0.66553875741150736,0.6655387574021624,0.66553875739257573,0.66553875738275481,0.66553875737270807,0.66553875736244295,0.66553875755909842,"I Buck Diode ON"]
[null,null,null,null,null,null,null,"Vf buck diode",{"$f":"IF(I153<I_Vd1,Vd_1+(I152-25)*vd_temp_coeff/1000,IF(I153=0,0,IF(Reset=1,0.45,FORECAST(I153, OFFSET(Vd_1:Vd_3,MATCH(I153,I_Vd1:I_Vd3,1)-1,0,2), OFFSET(I_Vd1:I_Vd3,MATCH(I153,I_Vd1:I_Vd3,1)-1,0,2))+(I152-25)*vd_temp_coeff/1000)))","v":0.33309770212547174},{"$f":"IF(J153<I_Vd1,Vd_1+(J152-25)*vd_temp_coeff/1000,IF(J153=0,0,IF(Reset=1,0.45,FORECAST(J153, OFFSET(Vd_1:Vd_3,MATCH(J153,I_Vd1:I_Vd3,1)-1,0,2), OFFSET(I_Vd1:I_Vd3,MATCH(J153,I_Vd1:I_Vd3,1)-1,0,2))+(J152-25)*vd_temp_coeff/1000)))","v":0.34782283892781019},{"$f":"IF(K153<I_Vd1,Vd_1+(K152-25)*vd_temp_coeff/1000,IF(K153=0,0,IF(Reset=1,0.45,FORECAST(K153, OFFSET(Vd_1:Vd_3,MATCH(K153,I_Vd1:I_Vd3,1)-1,0,2), OFFSET(I_Vd1:I_Vd3,MATCH(K153,I_Vd1:I_Vd3,1)-1,0,2))+(K152-25)*vd_temp_coeff/1000)))","v":0.34663822519888193},{"$f":"IF(L153<I_Vd1,Vd_1+(L152-25)*vd_temp_coeff/1000,IF(L153=0,0,IF(Reset=1,0.45,FORECAST(L153, OFFSET(Vd_1:Vd_3,MATCH(L153,I_Vd1:I_Vd3,1)-1,0,2), OFFSET(I_Vd1:I_Vd3,MATCH(L153,I_Vd1:I_Vd3,1)-1,0,2))+(L152-25)*vd_temp_coeff/1000)))","v":0.34554764417567541},{"$f":"IF(M153<I_Vd1,Vd_1+(M152-25)*vd_temp_coeff/1000,IF(M153=0,0,IF(Reset=1,0.45,FORECAST(M153, OFFSET(Vd_1:Vd_3,MATCH(M153,I_Vd1:I_Vd3,1)-1,0,2), OFFSET(I_Vd1:I_Vd3,MATCH(M153,I_Vd1:I_Vd3,1)-1,0,2))+(M152-25)*vd_temp_coeff/1000)))","v":0.34454036383397901},{"$f":"IF(N153<I_Vd1,Vd_1+(N152-25)*vd_temp_coeff/1000,IF(N153=0,0,IF(Reset=1,0.45,FORECAST(N153, OFFSET(Vd_1:Vd_3,MATCH(N153,I_Vd1:I_Vd3,1)-1,0,2), OFFSET(I_Vd1:I_Vd3,MATCH(N153,I_Vd1:I_Vd3,1)-1,0,2))+(N152-25)*vd_temp_coeff/1000)))","v":0.3436072204033197},{"$f":"IF(O153<I_Vd1,Vd_1+(O152-25)*vd_temp_coeff/1000,IF(O153=0,0,IF(Reset=1,0.45,FORECAST(O153, OFFSET(Vd_1:Vd_3,MATCH(O153,I_Vd1:I_Vd3,1)-1,0,2), OFFSET(I_Vd1:I_Vd3,MATCH(O153,I_Vd1:I_Vd3,1)-1,0,2))+(O152-25)*vd_temp_coeff/1000)))","v":0.3426969458036026},{"$f":"IF(P153<I_Vd1,Vd_1+(P152-25)*vd_temp_coeff/1000,IF(P153=0,0,IF(Reset=1,0.45,FORECAST(P153, OFFSET(Vd_1:Vd_3,MATCH(P153,I_Vd1:I_Vd3,1)-1,0,2), OFFSET(I_Vd1:I_Vd3,MATCH(P153,I_Vd1:I_Vd3,1)-1,0,2))+(P152-25)*vd_temp_coeff/1000)))","v":0.34189247044305693},{"$f":"IF(Q153<I_Vd1,Vd_1+(Q152-25)*vd_temp_coeff/1000,IF(Q153=0,0,IF(Reset=1,0.45,FORECAST(Q153, OFFSET(Vd_1:Vd_3,MATCH(Q153,I_Vd1:I_Vd3,1)-1,0,2), OFFSET(I_Vd1:I_Vd3,MATCH(Q153,I_Vd1:I_Vd3,1)-1,0,2))+(Q152-25)*vd_temp_coeff/1000)))","v":0.34114127486212564},{"$f":"IF(R153<I_Vd1,Vd_1+(R152-25)*vd_temp_coeff/1000,IF(R153=0,0,IF(Reset=1,0.45,FORECAST(R153, OFFSET(Vd_1:Vd_3,MATCH(R153,I_Vd1:I_Vd3,1)-1,0,2), OFFSET(I_Vd1:I_Vd3,MATCH(R153,I_Vd1:I_Vd3,1)-1,0,2))+(R152-25)*vd_temp_coeff/1000)))","v":0.34043824803004574},{"$f":"IF(S153<I_Vd1,Vd_1+(S152-25)*vd_temp_coeff/1000,IF(S153=0,0,IF(Reset=1,0.45,FORECAST(S153, OFFSET(Vd_1:Vd_3,MATCH(S153,I_Vd1:I_Vd3,1)-1,0,2), OFFSET(I_Vd1:I_Vd3,MATCH(S153,I_Vd1:I_Vd3,1)-1,0,2))+(S152-25)*vd_temp_coeff/1000)))","v":0.33977891094216528},{"$f":"IF(T153<I_Vd1,Vd_1+(T152-25)*vd_temp_coeff/1000,IF(T153=0,0,IF(Reset=1,0.45,FORECAST(T153, OFFSET(Vd_1:Vd_3,MATCH(T153,I_Vd1:I_Vd3,1)-1,0,2), OFFSET(I_Vd1:I_Vd3,MATCH(T153,I_Vd1:I_Vd3,1)-1,0,2))+(T152-25)*vd_temp_coeff/1000)))","v":0.33915932205910471},{"$f":"IF(U153<I_Vd1,Vd_1+(U152-25)*vd_temp_coeff/1000,IF(U153=0,0,IF(Reset=1,0.45,FORECAST(U153, OFFSET(Vd_1:Vd_3,MATCH(U153,I_Vd1:I_Vd3,1)-1,0,2), OFFSET(I_Vd1:I_Vd3,MATCH(U153,I_Vd1:I_Vd3,1)-1,0,2))+(U152-25)*vd_temp_coeff/1000)))","v":0.33857599919615378},{"$f":"IF(V153<I_Vd1,Vd_1+(V152-25)*vd_temp_coeff/1000,IF(V153=0,0,IF(Reset=1,0.45,FORECAST(V153, OFFSET(Vd_1:Vd_3,MATCH(V153,I_Vd1:I_Vd3,1)-1,0,2), OFFSET(I_Vd1:I_Vd3,MATCH(V153,I_Vd1:I_Vd3,1)-1,0,2))+(V152-25)*vd_temp_coeff/1000)))","v":0.33802585462461654},{"$f":"IF(W153<I_Vd1,Vd_1+(W152-25)*vd_temp_coeff/1000,IF(W153=0,0,IF(Reset=1,0.45,FORECAST(W153, OFFSET(Vd_1:Vd_3,MATCH(W153,I_Vd1:I_Vd3,1)-1,0,2), OFFSET(I_Vd1:I_Vd3,MATCH(W153,I_Vd1:I_Vd3,1)-1,0,2))+(W152-25)*vd_temp_coeff/1000)))","v":0.33750614085409514},{"$f":"IF(X153<I_Vd1,Vd_1+(X152-25)*vd_temp_coeff/1000,IF(X153=0,0,IF(Reset=1,0.45,FORECAST(X153, OFFSET(Vd_1:Vd_3,MATCH(X153,I_Vd1:I_Vd3,1)-1,0,2), OFFSET(I_Vd1:I_Vd3,MATCH(X153,I_Vd1:I_Vd3,1)-1,0,2))+(X152-25)*vd_temp_coeff/1000)))","v":0.33701440510311936},{"$f":"IF(Y153<I_Vd1,Vd_1+(Y152-25)*vd_temp_coeff/1000,IF(Y153=0,0,IF(Reset=1,0.45,FORECAST(Y153, OFFSET(Vd_1:Vd_3,MATCH(Y153,I_Vd1:I_Vd3,1)-1,0,2), OFFSET(I_Vd1:I_Vd3,MATCH(Y153,I_Vd1:I_Vd3,1)-1,0,2))+(Y152-25)*vd_temp_coeff/1000)))","v":0.33654845087864116},{"$f":"IF(Z153<I_Vd1,Vd_1+(Z152-25)*vd_temp_coeff/1000,IF(Z153=0,0,IF(Reset=1,0.45,FORECAST(Z153, OFFSET(Vd_1:Vd_3,MATCH(Z153,I_Vd1:I_Vd3,1)-1,0,2), OFFSET(I_Vd1:I_Vd3,MATCH(Z153,I_Vd1:I_Vd3,1)-1,0,2))+(Z152-25)*vd_temp_coeff/1000)))","v":0.33610630540425723},{"$f":"IF(AA153<I_Vd1,Vd_1+(AA152-25)*vd_temp_coeff/1000,IF(AA153=0,0,IF(Reset=1,0.45,FORECAST(AA153, OFFSET(Vd_1:Vd_3,MATCH(AA153,I_Vd1:I_Vd3,1)-1,0,2), OFFSET(I_Vd1:I_Vd3,MATCH(AA153,I_Vd1:I_Vd3,1)-1,0,2))+(AA152-25)*vd_temp_coeff/1000)))","v":0.33568619188563098},{"$f":"IF(AB153<I_Vd1,Vd_1+(AB152-25)*vd_temp_coeff/1000,IF(AB153=0,0,IF(Reset=1,0.45,FORECAST(AB153, OFFSET(Vd_1:Vd_3,MATCH(AB153,I_Vd1:I_Vd3,1)-1,0,2), OFFSET(I_Vd1:I_Vd3,MATCH(AB153,I_Vd1:I_Vd3,1)-1,0,2))+(AB152-25)*vd_temp_coeff/1000)))","v":0.33528650579641672},{"$f":"IF(AC153<I_Vd1,Vd_1+(AC152-25)*vd_temp_coeff/1000,IF(AC153=0,0,IF(Reset=1,0.45,FORECAST(AC153, OFFSET(Vd_1:Vd_3,MATCH(AC153,I_Vd1:I_Vd3,1)-1,0,2), OFFSET(I_Vd1:I_Vd3,MATCH(AC153,I_Vd1:I_Vd3,1)-1,0,2))+(AC152-25)*vd_temp_coeff/1000)))","v":0.33490579452165847},{"$f":"IF(AD153<I_Vd1,Vd_1+(AD152-25)*vd_temp_coeff/1000,IF(AD153=0,0,IF(Reset=1,0.45,FORECAST(AD153, OFFSET(Vd_1:Vd_3,MATCH(AD153,I_Vd1:I_Vd3,1)-1,0,2), OFFSET(I_Vd1:I_Vd3,MATCH(AD153,I_Vd1:I_Vd3,1)-1,0,2))+(AD152-25)*vd_temp_coeff/1000)))","v":0.33454273981755889},{"$f":"IF(AE153<I_Vd1,Vd_1+(AE152-25)*vd_temp_coeff/1000,IF(AE153=0,0,IF(Reset=1,0.45,FORECAST(AE153, OFFSET(Vd_1:Vd_3,MATCH(AE153,I_Vd1:I_Vd3,1)-1,0,2), OFFSET(I_Vd1:I_Vd3,MATCH(AE153,I_Vd1:I_Vd3,1)-1,0,2))+(AE152-25)*vd_temp_coeff/1000)))","v":0.33419614264381858},{"$f":"IF(AF153<I_Vd1,Vd_1+(AF152-25)*vd_temp_coeff/1000,IF(AF153=0,0,IF(Reset=1,0.45,FORECAST(AF153, OFFSET(Vd_1:Vd_3,MATCH(AF153,I_Vd1:I_Vd3,1)-1,0,2), OFFSET(I_Vd1:I_Vd3,MATCH(AF153,I_Vd1:I_Vd3,1)-1,0,2))+(AF152-25)*vd_temp_coeff/1000)))","v":0.33386491000281565},{"$f":"IF(AG153<I_Vd1,Vd_1+(AG152-25)*vd_temp_coeff/1000,IF(AG153=0,0,IF(Reset=1,0.45,FORECAST(AG153, OFFSET(Vd_1:Vd_3,MATCH(AG153,I_Vd1:I_Vd3,1)-1,0,2), OFFSET(I_Vd1:I_Vd3,MATCH(AG153,I_Vd1:I_Vd3,1)-1,0,2))+(AG152-25)*vd_temp_coeff/1000)))","v":0.33354804348286793},{"$f":"IF(AH153<I_Vd1,Vd_1+(AH152-25)*vd_temp_coeff/1000,IF(AH153=0,0,IF(Reset=1,0.45,FORECAST(AH153, OFFSET(Vd_1:Vd_3,MATCH(AH153,I_Vd1:I_Vd3,1)-1,0,2), OFFSET(I_Vd1:I_Vd3,MATCH(AH153,I_Vd1:I_Vd3,1)-1,0,2))+(AH152-25)*vd_temp_coeff/1000)))","v":0.33324462925386378},{"$f":"IF(AI153<I_Vd1,Vd_1+(AI152-25)*vd_temp_coeff/1000,IF(AI153=0,0,IF(Reset=1,0.45,FORECAST(AI153, OFFSET(Vd_1:Vd_3,MATCH(AI153,I_Vd1:I_Vd3,1)-1,0,2), OFFSET(I_Vd1:I_Vd3,MATCH(AI153,I_Vd1:I_Vd3,1)-1,0,2))+(AI152-25)*vd_temp_coeff/1000)))","v":0.33295382930511908},{"$f":"IF(AJ153<I_Vd1,Vd_1+(AJ152-25)*vd_temp_coeff/1000,IF(AJ153=0,0,IF(Reset=1,0.45,FORECAST(AJ153, OFFSET(Vd_1:Vd_3,MATCH(AJ153,I_Vd1:I_Vd3,1)-1,0,2), OFFSET(I_Vd1:I_Vd3,MATCH(AJ153,I_Vd1:I_Vd3,1)-1,0,2))+(AJ152-25)*vd_temp_coeff/1000)))","v":0.3326748737493288},{"$f":"IF(AK153<I_Vd1,Vd_1+(AK152-25)*vd_temp_coeff/1000,IF(AK153=0,0,IF(Reset=1,0.45,FORECAST(AK153, OFFSET(Vd_1:Vd_3,MATCH(AK153,I_Vd1:I_Vd3,1)-1,0,2), OFFSET(I_Vd1:I_Vd3,MATCH(AK153,I_Vd1:I_Vd3,1)-1,0,2))+(AK152-25)*vd_temp_coeff/1000)))","v":0.33240705404443094},{"$f":"IF(AL153<I_Vd1,Vd_1+(AL152-25)*vd_temp_coeff/1000,IF(AL153=0,0,IF(Reset=1,0.45,FORECAST(AL153, OFFSET(Vd_1:Vd_3,MATCH(AL153,I_Vd1:I_Vd3,1)-1,0,2), OFFSET(I_Vd1:I_Vd3,MATCH(AL153,I_Vd1:I_Vd3,1)-1,0,2))+(AL152-25)*vd_temp_coeff/1000)))","v":0.33214971700825796},{"$f":"IF(AM153<I_Vd1,Vd_1+(AM152-25)*vd_temp_coeff/1000,IF(AM153=0,0,IF(Reset=1,0.45,FORECAST(AM153, OFFSET(Vd_1:Vd_3,MATCH(AM153,I_Vd1:I_Vd3,1)-1,0,2), OFFSET(I_Vd1:I_Vd3,MATCH(AM153,I_Vd1:I_Vd3,1)-1,0,2))+(AM152-25)*vd_temp_coeff/1000)))","v":0.33190225951995656},{"$f":"IF(AN153<I_Vd1,Vd_1+(AN152-25)*vd_temp_coeff/1000,IF(AN153=0,0,IF(Reset=1,0.45,FORECAST(AN153, OFFSET(Vd_1:Vd_3,MATCH(AN153,I_Vd1:I_Vd3,1)-1,0,2), OFFSET(I_Vd1:I_Vd3,MATCH(AN153,I_Vd1:I_Vd3,1)-1,0,2))+(AN152-25)*vd_temp_coeff/1000)))","v":0.331664123818042},{"$f":"IF(AO153<I_Vd1,Vd_1+(AO152-25)*vd_temp_coeff/1000,IF(AO153=0,0,IF(Reset=1,0.45,FORECAST(AO153, OFFSET(Vd_1:Vd_3,MATCH(AO153,I_Vd1:I_Vd3,1)-1,0,2), OFFSET(I_Vd1:I_Vd3,MATCH(AO153,I_Vd1:I_Vd3,1)-1,0,2))+(AO152-25)*vd_temp_coeff/1000)))","v":0.33143479331821341},{"$f":"IF(AP153<I_Vd1,Vd_1+(AP152-25)*vd_temp_coeff/1000,IF(AP153=0,0,IF(Reset=1,0.45,FORECAST(AP153, OFFSET(Vd_1:Vd_3,MATCH(AP153,I_Vd1:I_Vd3,1)-1,0,2), OFFSET(I_Vd1:I_Vd3,MATCH(AP153,I_Vd1:I_Vd3,1)-1,0,2))+(AP152-25)*vd_temp_coeff/1000)))","v":0.33121378888516145},{"$f":"IF(AQ153<I_Vd1,Vd_1+(AQ152-25)*vd_temp_coeff/1000,IF(AQ153=0,0,IF(Reset=1,0.45,FORECAST(AQ153, OFFSET(Vd_1:Vd_3,MATCH(AQ153,I_Vd1:I_Vd3,1)-1,0,2), OFFSET(I_Vd1:I_Vd3,MATCH(AQ153,I_Vd1:I_Vd3,1)-1,0,2))+(AQ152-25)*vd_temp_coeff/1000)))","v":0.33100066550193807},{"$f":"IF(AR153<I_Vd1,Vd_1+(AR152-25)*vd_temp_coeff/1000,IF(AR153=0,0,IF(Reset=1,0.45,FORECAST(AR153, OFFSET(Vd_1:Vd_3,MATCH(AR153,I_Vd1:I_Vd3,1)-1,0,2), OFFSET(I_Vd1:I_Vd3,MATCH(AR153,I_Vd1:I_Vd3,1)-1,0,2))+(AR152-25)*vd_temp_coeff/1000)))","v":0.3307950092883245},{"$f":"IF(AS153<I_Vd1,Vd_1+(AS152-25)*vd_temp_coeff/1000,IF(AS153=0,0,IF(Reset=1,0.45,FORECAST(AS153, OFFSET(Vd_1:Vd_3,MATCH(AS153,I_Vd1:I_Vd3,1)-1,0,2), OFFSET(I_Vd1:I_Vd3,MATCH(AS153,I_Vd1:I_Vd3,1)-1,0,2))+(AS152-25)*vd_temp_coeff/1000)))","v":0.33059643482629608},{"$f":"IF(AT153<I_Vd1,Vd_1+(AT152-25)*vd_temp_coeff/1000,IF(AT153=0,0,IF(Reset=1,0.45,FORECAST(AT153, OFFSET(Vd_1:Vd_3,MATCH(AT153,I_Vd1:I_Vd3,1)-1,0,2), OFFSET(I_Vd1:I_Vd3,MATCH(AT153,I_Vd1:I_Vd3,1)-1,0,2))+(AT152-25)*vd_temp_coeff/1000)))","v":0.330404582756329},{"$f":"IF(AU153<I_Vd1,Vd_1+(AU152-25)*vd_temp_coeff/1000,IF(AU153=0,0,IF(Reset=1,0.45,FORECAST(AU153, OFFSET(Vd_1:Vd_3,MATCH(AU153,I_Vd1:I_Vd3,1)-1,0,2), OFFSET(I_Vd1:I_Vd3,MATCH(AU153,I_Vd1:I_Vd3,1)-1,0,2))+(AU152-25)*vd_temp_coeff/1000)))","v":0.3302191176131023},{"$f":"IF(AV153<I_Vd1,Vd_1+(AV152-25)*vd_temp_coeff/1000,IF(AV153=0,0,IF(Reset=1,0.45,FORECAST(AV153, OFFSET(Vd_1:Vd_3,MATCH(AV153,I_Vd1:I_Vd3,1)-1,0,2), OFFSET(I_Vd1:I_Vd3,MATCH(AV153,I_Vd1:I_Vd3,1)-1,0,2))+(AV152-25)*vd_temp_coeff/1000)))","v":0.33003972587324981},{"$f":"IF(AW153<I_Vd1,Vd_1+(AW152-25)*vd_temp_coeff/1000,IF(AW153=0,0,IF(Reset=1,0.45,FORECAST(AW153, OFFSET(Vd_1:Vd_3,MATCH(AW153,I_Vd1:I_Vd3,1)-1,0,2), OFFSET(I_Vd1:I_Vd3,MATCH(AW153,I_Vd1:I_Vd3,1)-1,0,2))+(AW152-25)*vd_temp_coeff/1000)))","v":0.32986611419132794},{"$f":"IF(AX153<I_Vd1,Vd_1+(AX152-25)*vd_temp_coeff/1000,IF(AX153=0,0,IF(Reset=1,0.45,FORECAST(AX153, OFFSET(Vd_1:Vd_3,MATCH(AX153,I_Vd1:I_Vd3,1)-1,0,2), OFFSET(I_Vd1:I_Vd3,MATCH(AX153,I_Vd1:I_Vd3,1)-1,0,2))+(AX152-25)*vd_temp_coeff/1000)))","v":0.3296980078031761},{"$f":"IF(AY153<I_Vd1,Vd_1+(AY152-25)*vd_temp_coeff/1000,IF(AY153=0,0,IF(Reset=1,0.45,FORECAST(AY153, OFFSET(Vd_1:Vd_3,MATCH(AY153,I_Vd1:I_Vd3,1)-1,0,2), OFFSET(I_Vd1:I_Vd3,MATCH(AY153,I_Vd1:I_Vd3,1)-1,0,2))+(AY152-25)*vd_temp_coeff/1000)))","v":0.32953514907843739},{"$f":"IF(AZ153<I_Vd1,Vd_1+(AZ152-25)*vd_temp_coeff/1000,IF(AZ153=0,0,IF(Reset=1,0.45,FORECAST(AZ153, OFFSET(Vd_1:Vd_3,MATCH(AZ153,I_Vd1:I_Vd3,1)-1,0,2), OFFSET(I_Vd1:I_Vd3,MATCH(AZ153,I_Vd1:I_Vd3,1)-1,0,2))+(AZ152-25)*vd_temp_coeff/1000)))","v":0.32937729620623951},{"$f":"IF(BA153<I_Vd1,Vd_1+(BA152-25)*vd_temp_coeff/1000,IF(BA153=0,0,IF(Reset=1,0.45,FORECAST(BA153, OFFSET(Vd_1:Vd_3,MATCH(BA153,I_Vd1:I_Vd3,1)-1,0,2), OFFSET(I_Vd1:I_Vd3,MATCH(BA153,I_Vd1:I_Vd3,1)-1,0,2))+(BA152-25)*vd_temp_coeff/1000)))","v":0.32922422199996859},{"$f":"IF(BB153<I_Vd1,Vd_1+(BB152-25)*vd_temp_coeff/1000,IF(BB153=0,0,IF(Reset=1,0.45,FORECAST(BB153, OFFSET(Vd_1:Vd_3,MATCH(BB153,I_Vd1:I_Vd3,1)-1,0,2), OFFSET(I_Vd1:I_Vd3,MATCH(BB153,I_Vd1:I_Vd3,1)-1,0,2))+(BB152-25)*vd_temp_coeff/1000)))","v":0.32907571280873998},{"$f":"IF(BC153<I_Vd1,Vd_1+(BC152-25)*vd_temp_coeff/1000,IF(BC153=0,0,IF(Reset=1,0.45,FORECAST(BC153, OFFSET(Vd_1:Vd_3,MATCH(BC153,I_Vd1:I_Vd3,1)-1,0,2), OFFSET(I_Vd1:I_Vd3,MATCH(BC153,I_Vd1:I_Vd3,1)-1,0,2))+(BC152-25)*vd_temp_coeff/1000)))","v":0.32893156752462083},{"$f":"IF(BD153<I_Vd1,Vd_1+(BD152-25)*vd_temp_coeff/1000,IF(BD153=0,0,IF(Reset=1,0.45,FORECAST(BD153, OFFSET(Vd_1:Vd_3,MATCH(BD153,I_Vd1:I_Vd3,1)-1,0,2), OFFSET(I_Vd1:I_Vd3,MATCH(BD153,I_Vd1:I_Vd3,1)-1,0,2))+(BD152-25)*vd_temp_coeff/1000)))","v":0.3287915966759265},{"$f":"IF(BE153<I_Vd1,Vd_1+(BE152-25)*vd_temp_coeff/1000,IF(BE153=0,0,IF(Reset=1,0.45,FORECAST(BE153, OFFSET(Vd_1:Vd_3,MATCH(BE153,I_Vd1:I_Vd3,1)-1,0,2), OFFSET(I_Vd1:I_Vd3,MATCH(BE153,I_Vd1:I_Vd3,1)-1,0,2))+(BE152-25)*vd_temp_coeff/1000)))","v":0.32865562159801132},{"$f":"IF(BF153<I_Vd1,Vd_1+(BF152-25)*vd_temp_coeff/1000,IF(BF153=0,0,IF(Reset=1,0.45,FORECAST(BF153, OFFSET(Vd_1:Vd_3,MATCH(BF153,I_Vd1:I_Vd3,1)-1,0,2), OFFSET(I_Vd1:I_Vd3,MATCH(BF153,I_Vd1:I_Vd3,1)-1,0,2))+(BF152-25)*vd_temp_coeff/1000)))","v":0.32852347367393869},{"$f":"IF(BG153<I_Vd1,Vd_1+(BG152-25)*vd_temp_coeff/1000,IF(BG153=0,0,IF(Reset=1,0.45,FORECAST(BG153, OFFSET(Vd_1:Vd_3,MATCH(BG153,I_Vd1:I_Vd3,1)-1,0,2), OFFSET(I_Vd1:I_Vd3,MATCH(BG153,I_Vd1:I_Vd3,1)-1,0,2))+(BG152-25)*vd_temp_coeff/1000)))","v":0.3283949936382593},{"$f":"IF(BH153<I_Vd1,Vd_1+(BH152-25)*vd_temp_coeff/1000,IF(BH153=0,0,IF(Reset=1,0.45,FORECAST(BH153, OFFSET(Vd_1:Vd_3,MATCH(BH153,I_Vd1:I_Vd3,1)-1,0,2), OFFSET(I_Vd1:I_Vd3,MATCH(BH153,I_Vd1:I_Vd3,1)-1,0,2))+(BH152-25)*vd_temp_coeff/1000)))","v":0.32378409786711027},"Vf buck diode"]
[null,null,null,null,null,null,null,"Pdiss buck diode",{"$f":"I154*I106","v":0.11643714415353321},1.4179249856137497E-2,2.2405734084798672E-2,2.9979213412598831E-2,3.6974215785440294E-2,4.3454378498249131E-2,4.9775729884978442E-2,5.5362364332873414E-2,6.0579000311009532E-2,6.5461131088488153E-2,7.0039860864180875E-2,7.4342561439223048E-2,7.8393414651759349E-2,8.2213863062051959E-2,8.582298646439962E-2,8.9237818063325314E-2,9.2473611282645737E-2,9.5544065958369229E-2,9.8461520939937527E-2,0.10123711877130548,0.10388094705623235,0.10640216026543912,0.10880908506758816,0.11110931172386981,0.11330977364868056,0.11541681688440918,0.11743626094965327,0.11937345228399705,0.12123331131840322,0.12302037404013122,0.1247388287884324,0.12639254890695023,{"$f":"AO154*AO106","v":0.12798512178667146},0.12951987475614515,0.13099989821086416,0.13242806631903853,0.13380705559475711,0.13513936159030124,0.13642731392599269,0.13767308984746995,0.13887872647591154,0.14004613189581006,0.14117709520691421,0.14227329565144103,0.14333631091425786,0.14436762468211567,0.14536863353793231,0.14634065325734752,0.14728492456711992,0.14820261841824944,0.14909484082085409,0.18111495166653882,"Pdiss buck diode"]
[null,null,null,null,null,null,null,"Pout",{"$f":"I99*Iout_PreReg","v":3.5606323529411763},3.5606323529411767,3.5606323529411767,3.5606323529411763,3.5606323529411763,3.5606323529411763,3.5606323529411763,3.5606323529411763,3.5606323529411763,3.5606323529411763,3.5606323529411767,3.5606323529411763,3.5606323529411763,3.5606323529411759,3.5606323529411763,3.5606323529411763,3.5606323529411767,3.5606323529411759,3.5606323529411767,3.5606323529411759,3.5606323529411763,3.5606323529411776,3.5606323529411767,3.5606323529411763,3.5606323529411776,3.5606323529411767,3.5606323529411759,3.5606323529411759,3.5606323529411763,3.5606323529411763,3.5606323529411763,3.5606323529411763,{"$f":"AO99*Iout_PreReg","v":3.5606323529411767},3.5606323529411763,3.5606323529411767,3.5606323529411763,3.5606323529411763,3.5606323529411767,3.5606323529411767,3.5606323529411763,3.5606323529411759,3.5606323529411767,3.5606323529411767,3.5606323529411776,3.5606323529411763,3.5606323529411763,3.5606323529411763,3.5606323529411767,3.5606323529411763,3.5606323529411767,3.5606323529411763,3.5606323529411763]
[null,null,null,null,null,null,null,"P loss",{"$f":"I88+I155+I104*dcr*10^-3","v":0.51312842923858892},0.34131158239739123,0.34881948154441944,0.35614355481662774,0.3633215675389076,0.37038577619652441,0.37087038027336983,0.37798815017416976,0.3850521622483884,0.39208158934458326,0.39909321403181303,0.40610178556475029,0.41312031535000637,0.4201603228265986,0.42723204112664648,0.4343445899280558,0.44150612140078188,0.44872394397351345,0.45600462772797129,0.46335409450372061,0.47077769522262641,0.47828027648507554,0.48586623812413032,0.4935395831092646,0.50130396095315777,0.50916270558152532,0.51711886846805544,0.52517524770710577,0.53333441359032596,0.54159873116538992,0.5499703801820639,0.55845137277011214,{"$f":"AO88+AO155+AO104*dcr*10^-3","v":0.56704356914282716},0.57574869157746389,0.58456833688812371,0.59350398757649225,0.60255702182033599,0.61172872243802523,0.6210202849489469,0.63043282483395746,0.63996738408659481,0.64962493713423841,0.6594063961985045,0.66931261615561666,0.679344398950116,0.68950249760889215,0.69978761989696525,0.71020043165163216,0.72074155982739452,0.73141159528040633,0.74221109531798735,1.1427200665958783]
[null,null,null,null,null,null,null,"Efficiency",{"$f":"I156/(I156+I157)","v":0.8740406085003285},{"$f":"J156/(J156+J157)","v":0.91252780971396097},0.91077534746241051,0.90907226678165887,0.90740931853387918,0.90577866495930626,0.90566701705682595,0.90403031978450554,0.9024118221398425,0.90080699107766649,0.89921190060226841,0.89762313999755261,0.89603773816963328,0.89445310091524366,0.89286695862522836,0.89127732246281621,0.88968244746369607,0.88808080131994771,0.88647103785515524,0.88485197439023799,0.88322257235106783,0.88158192058910234,0.87992922098207926,0.87826377595863159,0.87658497765255738,0.87489229844257888,0.8731852826741735,0.87146353939334353,0.86972673594950101,0.86797459234714336,0.86620687624459491,0.86442339851354255,0.86262400928594829,0.86080859442569435,0.85897707237132681,0.85712939130386545,0.85526552660005917,0.85338547853689084,0.85148927021774667,0.84957694569459585,0.84764856826386936,0.84570421891660641,0.84374399492589147,0.84176800855673239,0.83977638588535031,0.8377692657164385,0.83574679858831113,0.83370914585705458,0.83165647885182648,0.82958897809434873,0.82750683257642821,0.75704136865245686]
[]
[]
[]
[null,null,null,null,null,null,null,null,null,null,null,null,null,null,null,null,null,"Minimum off time for regulation",80]
[null,null,null,null,null,null,null,null,null,null,null,"Vin",{"$f":"Vin_min","v":3.5},{"$f":"Vin_max","v":18},null,null,null,"Maximum allowed Buck duty cycle",{"$f":"(1/(fsw*10^3)-t_off_min*10^-9)*fsw*10^3","v":0.84000000000000008},{"$f":"IF(MAX(J12:BG12)>S163,\"Increase Boost Duty Cycle\",\"OK\")","v":"OK"},null,null,"Lx SLEW rate",0.9]
[null,null,null,null,null,null,null,null,null,null,null,"Ta",{"$f":"Ta","v":125},{"$f":"Ta","v":125},null,null,null,null,"-40C","150C","Ohms/C"]
[null,null,null,null,null,null,null,null,null,null,null,"Tjmax",155,155,null,null,"Buck Fet","Vin < 5.5V",{"$f":"1.25*Rds_ON_min40_7V","v":0.14611437500000002},{"$f":"1.1429*Rds_ON_150_7V","v":0.30286850000000004},{"$f":"(Rds_ON_150-Rds_ON_min40)/190","v":8.2502171052631595E-4},null,null,"Pre_Reg","Adj Buck"]
[null,null,null,null,null,null,null,null,null,null,null,"Vin",2,18,null,null,null,"5V ≤ Vin ≤ 7V",{"$f":"1.1667*Rds_ON_min40_7V","v":0.13637731305000003},{"$f":"1.0714*Rds_ON_150_7V","v":0.28392099999999998},{"$f":"(T166-S166)/190","v":7.7654572078947337E-4},null,"C_Vripple",{"$f":"ROUNDUP(2*MAX(J23:BG23)/(8*C48*fsw),0)","v":1},{"$f":"ROUNDUP(2*MAX(J44:BG44)/(8*C114*fsw),0)","v":1}]
[null,null,null,null,null,null,null,null,null,null,null,"5V out",4.75,4.75,null,null,null,"Vin > 7V",{"$f":"Rds_ON_150_7V*0.4411","v":0.11689150000000001},{"$f":"V175","v":0.26500000000000001},{"$f":"(T167-S167)/190","v":7.7951842105263155E-4},null,"C Istep up",{"$f":"IF(Vin_min_transient>Vreg,ROUNDUP(L_buck*I_step^2/(2*V_transient*D_max_IC*(Vin_min_transient-Vreg)),0),ROUNDUP(L_buck*I_step^2/(2*V_transient*D_max_IC*(0.7)),0))","v":24},{"$f":"IF(Vin_min_transient2>Vout_sync_buck,ROUNDUP(L_buck2*I_step2^2/(2*V_transient2*D_max_IC*(Vin_min_transient2-Vout_sync_buck)),0),ROUNDUP(L_buck2*I_step2^2/(2*V_transient2*D_max_IC*(0.7)),0))","v":16}]
[null,null,null,null,null,null,null,null,null,null,null,"Vin",0,14,null,null,"3V3",null,null,null,{"$f":"(Rds_ON_3V3_150-Rds_ON_3V3_min40)/190","v":9.2473684210526324E-4},null,"C Istep down",{"$f":"ROUNDUP(L_buck*I_step^2/(2*V_transient*D_max_IC*Vreg),0)","v":8},{"$f":"ROUNDUP(L_buck2*I_step2^2/(2*V_transient2*D_max_IC*Vout_sync_buck),0)","v":10}]
[null,null,null,null,null,null,null,null,null,null,null,"Max buck duty",{"$f":"(1/(fsw*10^3)-t_off_min*10^-9)*fsw*10^3","v":0.84000000000000008},{"$f":"(1/(fsw*10^3)-t_off_min*10^-9)*fsw*10^3","v":0.84000000000000008},null,null,"V5CAN",null,null,null,{"$f":"(Rds_ON_V5CAN_150-Rds_ON_V5CAN_min40)/190","v":1.3831578947368422E-3},null,"ESR ="]
[null,null,null,null,null,null,null,null,null,null,null,null,null,null,null,null,null,null,null,null,null,null,"ESL =",1.8,2.8]
[null,null,null,null,null,null,null,null,null,null,null,null,null,null,null,null,null,null,null,null,null,null,"Co_tot_min",{"$f":"C57*C55","v":25.5},{"$f":"C123*C121","v":17}]
[]
[null,null,null,null,null,null,null,null,null,null,null,null,null,null,null,null,null,null,"A4413 Operating at Vin nom"]
[null,null,null,null,null,null,null,null,null,null,null,null,null,null,null,null,null,null,null,"Vout","Pdiss_max","Rds_ON at 150","Rds_ON at -40"]
[null,null,null,null,null,null,null,null,null,null,null,"Boost Duty Cycle Slope ",null,null,null,null,null,null,"Fet Power Loss ",{"$f":"IF(Topology=\"Buck\",I99,Vreg)","v":5.35},{"$f":"IF(Topology=\"Buck\",I111,I33)","v":0.22771028142562699},0.26500000000000001,null,{"$f":"J31","v":0.57257786448155401}]
[null,null,null,null,null,null,null,null,null,null,null,"Vin",3.5,6.5,null,null,null,null,"3V3 LDO",{"$f":"IF(Topology=\"Buck\",I112,I34)","v":3.3},{"$f":"IF(Topology=\"Buck\",I115,I36)","v":0},0.503,0.32729999999999998,{"$f":"J4","v":150.82807655024854}]
[null,null,null,null,null,null,null,null,null,null,null,"Duty",0.57999999999999996,0.2,null,"Icc",0.01,null,"V5A LDO",{"$f":"IF(Topology=\"Buck\",I136,I57)","v":5},{"$f":"IF(Topology=\"Buck\",I139,I59)","v":0},0.69899999999999995,0.2402]
[null,null,null,null,null,null,null,null,null,null,null,null,"m","b",null,"Rds_On at 25°C",{"$f":"Rds_ON_150/Rds_on_coeff_150","v":0.22937466104239851},null,"V5SNR LDO",{"$f":"IF(Topology=\"Buck\",I140,I60)","v":5},{"$f":"IF(Topology=\"Buck\",I143,I62)","v":0},0.69899999999999995,0.2402]
[null,null,null,null,null,null,null,null,null,null,null,null,{"$f":"(M177-N177)/(M176-N176)","v":-0.12666666666666665},{"$f":"M177-M179*M176","v":1.0233333333333332},null,"Thermal coeff at 150C",{"$f":"(150+40)*(1.34655999666222-0.667409045393858)/0.828125/(Rds_ON_150*1000)+0.667409045393858/0.828125","v":1.32040958065554},null,"V5CAN LDO",{"$f":"IF(Topology=\"Buck\",I144,I63)","v":5},{"$f":"IF(Topology=\"Buck\",I147,I65)","v":0},0.503,0.2402]
[null,null,null,null,null,null,null,null,null,null,null,null,null,null,null,null,null,null,"V5P LDO",{"$f":"IF(Topology=\"Buck\",I148,I66)","v":5},{"$f":"IF(Topology=\"Buck\",I151,I68)","v":2.6249999999999971E-2},0.69899999999999995,0.2402]
[null,null,null,null,null,null,null,null,null,null,null,"Dead Time",15,"ns",null,null,null,null,"Adj Buck Hi side",null,null,0.3]
[null,null,null,null,null,null,null,null,null,null,null,null,null,null,null,null,null,null,"Adj Buck Lo side",null,null,0.11]

{"sheet":"Control Loop1","index":1,"n_rows":137,"n_cols":21,"rows_kept":137,"cut":false,"hidden":false,"merged":[[31,16,31,17],[0,1,0,2],[0,4,0,5],[31,2,31,3],[31,4,31,5],[31,6,31,7],[31,14,31,15]]}
[null,"Series RC with Parallel C",null,null,"No feedforward C"]
[null,"Rz",{"$f":"Rz","v":15.8},"kΩ","Cz2",39,"pF"]
[null,"Cz",{"$f":"Cz","v":1.5},"nF","Rz2",0,"kΩ"]
[null,"Cp",{"$f":"Cp","v":27},"pF"]
[null,null,null,null,"AVOL",60,"dB"]
[null,"Ro_EA",1300,"kΩ",null,{"$f":"10^(F5/20)","v":1000},"V/V"]
[null,"Cstray",15,"pF","gm_EA1",750,"uA/V"]
[null,null,null,null,"RFB1",{"$f":"(Vreg-VFB)/VFB*RFB_2","v":56.874999999999993},"kΩ"]
[null,"Cp +Cstray",{"$f":"IF(Type=RCC,Cp+Cstray,IF(Type=RCRC,Cp+Cstray,Cstray))","v":42},"pF","RFB2",10,"kΩ"]
[null,null,null,null,"FB Gain",{"$f":"RFB_2/(RFB_1+RFB_2)","v":0.14953271028037382}]
[null,null,null,null,"VFB",0.8,"V"]
[null,"Series RC"]
[null,"Series RC with Parallel C",null,null,"Ri",{"$f":"1/gm_POWER1","v":0.27777777777777779}]
[null,null,null,null,"gmPOWER1",3.6,"A/V"]
[null,null,null,null,"K",{"$f":"Vreg/(Iout_PreReg*Ri*(1+Vreg*(m_c*(1-Vreg/Vin_nom)-0.5)/(Iout_PreReg*fsw*10^3*L_buck*10^-6)))","v":20.926771825047439}]
[null,null,null,null,"mc",{"$f":"(1+Se/Sn)","v":2.071127819548872}]
[null,"No feedforward C",null,null,"Se (Slope Comp)",{"$f":"0.00051*fsw+0.0275","v":1.0475000000000001},"A/us"]
[null,"Feedforward RC",null,null,"Sn (Inductor)",{"$f":"(Vin_nom-Vreg)/L_buck","v":0.97794117647058831},"A/us"]
[null,null,null,null,"wn",{"$f":"PI()*fsw*10^3","v":6283185.307179586}]
[null,"Calculated",null,null,"Qp",{"$f":"1/(PI()*(m_c*(1-Vreg/Vin_nom)-0.5))","v":0.49140854679087714}]
["fco1",{"$f":"VLOOKUP(MIN(A35:A134),A35:H134,2,FALSE)/1000","v":38.5352859371054}]
["PM1",{"$f":"VLOOKUP(MIN(A35:A134),A35:H134,8,FALSE)","v":68.906657982788559}]
[null,null,null,null,"wp",{"$f":"(1/(Vreg/Iout_PreReg*Number_Cout*Co*10^-6)+(m_c*(1-Vreg/Vin_nom)-0.5)/(fsw*10^3*L_buck*10^-6*Number_Cout*Co*10^-6))/(1000)","v":6.7462134995546679},"Rad"]
[null,null,null,null,"wz",{"$f":"1/(ESR*10^-3*Co*10^-6*1000)","v":39215.686274509804},"Rad"]
[]
[]
[]
[]
[]
[]
[]
[null,null,"Error Amplifier",null,"Control to Output",null,"Total System",null,"Error Amp"]
["Calculated","Frequency","Gain","Phase","Gain","Phase","Gain","Phase","ZCz","ZCp","ZT(s)","RFB1 with or without feedforward C","Tv(s)","1 + s/ωP","1 + s/ωZ","fp(s)","fh(s)","fp(s)fh(s)","Gain","Phase","Freq (kHz)"]
[]
[{"$f":"ABS(G35)","v":65.464130794140715},100,{"$f":"20*LOG(IMABS(M35))","v":39.087596103392535},{"$f":"IF(180/PI()*IMARGUMENT(M35)>0,180/PI()*IMARGUMENT(M35),360+180/PI()*IMARGUMENT(M35))","v":128.95918948538718},{"$f":"S35","v":26.376534690748187},{"$f":"T35","v":-5.3317183120529785},{"$f":"C35+E35","v":65.464130794140715},{"$f":"D35+F35","v":123.6274711733342},{"$f":"IMDIV(1,COMPLEX(0,2*PI()*$B35*Cz*10^-9))","v":"-1061032.95394597i"},{"$f":"IMDIV(1,COMPLEX(0,2*PI()*$B35*Cp_Cstray*10^-12))","v":"-37894034.0694988i"},{"$f":"IMDIV(IMPRODUCT(IMDIV(IMPRODUCT(J35,IMSUM(Rz*10^3,I35)),IMSUM(J35,IMSUM(Rz*10^3,I35))),Ro_EA*10^3),IMSUM(IMDIV(IMPRODUCT(J35,IMSUM(Rz*10^3,I35)),IMSUM(J35,IMSUM(Rz*10^3,I35))),Ro_EA*10^3))","v":"504744.809133224-624216.502800865i"},{"$f":"IF($E$1=\"Feedforward RC\",IMDIV(IMPRODUCT(IMSUM(Rz_2*10^3,IMDIV(1,COMPLEX(0,2*PI()*$B35*Cz_2*10^-12))),RFB_1*10^3),IMSUM(IMSUM(Rz_2*10^3,IMDIV(1,COMPLEX(0,2*PI()*$B35*Cz_2*10^-12))),RFB_1*10^3)),RFB_1*10^3)","v":56874.999999999993},{"$f":"IMPRODUCT(-gm_EA1*10^-6,K35,IMDIV(RFB_2*10^3,IMSUM(L35,RFB_2*10^3)))","v":"-56.6068944822308+70.0055890991625i"},{"$f":"COMPLEX(1,2*PI()*B35*1/(1/(Vreg/Iout_PreReg*Number_Cout*Co*10^-6)+(m_c*(1-Vreg/Vin_nom)-0.5)/(fsw*10^3*L_buck*10^-6*Number_Cout*Co*10^-6)))","v":"1+0.0931364728909684i"},{"$f":"COMPLEX(1,2*PI()*B35*(ESR*10^-3*Co*10^-6))","v":"1+0.0000160221225333079i"},{"$f":"IMPRODUCT(K,IMDIV(O35,N35))","v":"20.7468366395703-1.93195189695228i"},{"$f":"IMDIV(1,IMSUM(COMPLEX(1,2*PI()*B35/(wn*Qp)),IMPRODUCT(COMPLEX(0,2*PI()*B35/wn),COMPLEX(0,2*PI()*B35/wn))))","v":"0.999999968589108-0.000203496659779234i"},{"$f":"IMPRODUCT(P35,Q35)","v":"20.7464428421358-1.93617374822509i"},{"$f":"20*LOG(IMABS(R35))","v":26.376534690748187},{"$f":"180/PI()*IMARGUMENT(R35)","v":-5.3317183120529785},{"$f":"B35/1000","v":0.1}]
[{"$f":"ABS(G36)","v":64.939223961651095},109.74987654930599,{"$f":"20*LOG(IMABS(M36))","v":38.57032047678112},{"$f":"IF(180/PI()*IMARGUMENT(M36)>0,180/PI()*IMARGUMENT(M36),360+180/PI()*IMARGUMENT(M36))","v":126.48300489934643},{"$f":"S36","v":26.368903484869971},-5.8481304910829959,{"$f":"C36+E36","v":64.939223961651095},120.63487440826343,{"$f":"IMDIV(1,COMPLEX(0,2*PI()*$B36*Cz*10^-9))","v":"-966773.710646764i"},"-34527632.5230987i","449709.44374472-608124.598419778i",56874.999999999993,{"$f":"IMPRODUCT(-gm_EA1*10^-6,K36,IMDIV(RFB_2*10^3,IMSUM(L36,RFB_2*10^3)))","v":"-50.4347039713705+68.2008895424051i"},"1+0.102217164020216i","1+0.000017584259700884i",{"$f":"IMPRODUCT(K,IMDIV(O36,N36))","v":"20.710419753445-2.11659239107493i"},"0.999999962165469-0.000223337331911765i",{"$f":"IMPRODUCT(P36,Q36)","v":"20.7099462557786-2.12121772088516i"},{"$f":"20*LOG(IMABS(R36))","v":26.368903484869971},{"$f":"180/PI()*IMARGUMENT(R36)","v":-5.8481304910829959},{"$f":"B36/1000","v":0.109749876549306}]
[64.379184796519553,120.450354025878,38.019455358796947,124.09030421546967,26.359729437722613,-6.4138004687623775,64.379184796519553,117.6765037467073,"-880888.198732913i","-31460292.8118896i","397878.097565878-587877.75987679i",56874.999999999993,"-44.6218427176686+65.9302160609485i","1+0.112183211324387i","1+0.0000192987033138294i","20.6667248918783-2.31805570636778i","0.999999954428175-0.00024511244476894i","20.6661557657566-2.32312127219337i",26.359729437722613,-6.4138004687623775,0.120450354025878]
[63.785908094858215,132.19411484660299,37.43720316191493,121.79759942985029,26.348704932943285,-7.0331854840671655,63.785908094858215,114.76441394578313,"-802632.518987084i","-28665447.1066816i","349790.110362673-564206.47583963i",56874.999999999993,"-39.2287974238512+63.2754926175287i","1+0.123120935937562i","1+0.0000211803030625446i","20.6143384866114-2.53761341283592i","0.999999945108575-0.000269010603831979i","20.6136547101445-2.54315874918658i",26.348704932943285,-7.0331854840671655,0.13219411484660298]
[63.16150913726954,145.08287784959401,36.8260462109169,119.61832782661249,26.335462926352641,-7.7110697435147175,63.16150913726954,111.90725808309777,"-731328.85814819i","-26118887.7910068i","305791.308697264-537889.352540391i",56874.999999999993,"-34.2943523772633+60.3240395372402i","1+0.135125075197824i","1+0.0000232453564639114i","20.5515904654925-2.77654875681386i","0.999999933883085-0.00029523880335105i",{"$f":"IMPRODUCT(P39,Q39)","v":"20.5507693617523-2.78261620021301i"},26.335462926352641,-7.7110697435147175,0.14508287784959401]
[62.508193779230027,159.228279334109,36.188627476144198,117.56277204694533,26.319566303085828,-8.4525637091614474,62.508193779230027,109.11020833778387,"-666359.6180171i","-23798557.786325i","266043.281045271-509700.207263342i",56874.999999999993,"-29.836629649937+57.1626400669169i","1+0.148299603216768i","1+0.0000255117500225888i","20.4765156524933-3.03612526795512i","0.999999920361943-0.000324024219217042i","20.475530243664-3.04275991316059i",26.319566303085828,-8.4525637091614474,0.15922827933410899]
[61.828137467006925,174.752840000768,35.527641770356176,115.63818027050425,26.300495696650753,-9.2630939852856891,61.828137467006925,106.37508628521856,"-607162.066116524i","-21684359.5041616i","230546.256131127-480365.422472422i",56874.999999999993,"-25.8556548932105+53.8727576604586i","1+0.162758631453513i","1+0.0000279991141553586i","20.3868129296892-3.31754384106178i","0.999999904075679-0.000355616176632734i",{"$f":"IMPRODUCT(P41,Q41)","v":"20.3856312018414-3.32479340329642i"},26.300495696650753,-9.2630939852856891,0.17475284000076802]
[61.123379928113124,191.79102616724899,34.845744214982091,113.84903802447566,26.277635713131033,-10.148380521744858,61.123379928113124,103.70065750273081,"-553223.461571507i","-19757980.7704109i","199169.951339908-450533.991423648i",56874.999999999993,"-22.3368169727+50.5271766082596i","1+0.17862739709357i","1+0.0000307289932204053i","20.2798038428626-3.62188551538918i","0.999999884458817-0.000390288309624999i","20.2783879201346-3.6298000672736i",26.277635713131033,-10.148380521744858,0.191791026167249]
[60.395738893067637,210.49041445120201,34.145479305447708,112.19743830623821,26.250259587619929,-11.114397107280647,60.395738893067637,101.08304119895756,"-504076.613993246i","-18002736.2140445i","171687.133694422-420760.252545097i",56874.999999999993,"-19.2546318161969+47.1880657059922i","1+0.196043347793431i","1+0.0000337250321242393i","20.1523933661846-3.95003690550491i","0.999999860830238-0.000428340931100878i","20.1506985990948-3.9586684507176i",26.250259587619929,-11.114397107280647,0.21049041445120201]
[59.646743371569052,231.01297000831599,33.429230941208743,110.68350051392413,26.217512430360308,-12.167310336645782,59.646743371569052,98.516190177278347,"-459295.83689945i","-16403422.7464089i","147805.799048591-391497.617897254i",56874.999999999993,"-16.5763512951691+43.906274904365i","1+0.215157332186416i","1+0.0000370131811225663i","20.0010369247903-4.30259517930399i","0.999999832369531-0.00047010363397338i","19.9990109063778-4.31199701819952i",26.217512430360308,-12.167310336645782,0.231012970008316]
[58.877585078044518,253.53644939701101,32.699191666782426,109.30579776318299,26.178393411262093,-13.313391475682995,58.877585078044518,95.992406287500003,"-418493.260621673i","-14946187.8793455i","127197.320211658-363100.739654601i",56874.999999999993,"-14.2651200237374+40.7215782790207i","1+0.236134906461371i","1+0.0000406219205889874i","19.8217195427092-4.67974980445789i","0.999999798088511-0.00051593814588351i","19.819301079039-4.68997564079173i",26.178393411262093,-13.313391475682995,0.25353644939701103]
[58.089085642851593,278.255940220713,31.957348144590334,108.06176331524419,26.131737498261259,-14.558895045715222,58.089085642851593,93.502868269528975,"-381315.4727638i","-13618409.7415643i","109519.261828053-335833.388691282i",56874.999999999993,"-12.282534036791+37.6635576102373i","1+0.259157768331174i","1+0.0000445825076983707i","19.609955119574-5.08113923789728i","0.999999756796902-0.000566241462240508i","19.6070731986602-5.09224197180985i",26.131737498261259,-14.558895045715222,0.27825594022071298]
[57.281677133373577,305.38555088334198,31.205479413726312,106.94805765779499,26.076197719647261,-15.909897701328019,57.281677133373577,91.03815995646697,"-347440.457112945i","-12408587.7540338i","94432.6034230463-309879.605182606i",56874.999999999993,"-10.5905723465099+34.7528529176755i","1+0.284425330811398i","1+0.0000489292471615465i","19.360816222342-5.50568262762737i","0.999999707061017-0.00062144928471161i","19.3573890482734-5.51771278019111i",26.076197719647261,-15.909897701328019,0.30538555088334196]
[56.455393933638248,335.16026509388399,30.445164566006163,105.96088686843498,26.010229367632085,-17.372091369101174,56.455393933638248,88.588795499333813,"-316574.804489057i","-11306243.0174663i","81613.7961389466-285356.191162401i",56874.999999999993,"-9.15294909969496+32.0025634948487i","1+0.312156449440463i","1+0.0000536997883563018i","19.0690071179997-5.95138979309173i","0.99999964715397-0.00068203979493644i","19.0649413049022-5.96439351487187i",26.010229367632085,-17.372091369101174,0.33516026509388397]
[55.609874963642874,367.83797718286303,29.677796874712463,105.09626970469523,25.93207808893041,-18.950526025851747,55.609874963642874,86.145743678843488,"-288451.171374971i","-10301827.5491061i","70762.4422786598-262325.174578855i",56874.999999999993,"-7.93597483498989+29.4196457471613i","1+0.342591317901604i","1+0.0000589354514282796i","18.72899453148-6.41515759076723i","0.999999574995725-0.000748537796142377i","18.7241845836524-6.42917422458839i",25.93207808893041,-18.950526025851747,0.36783797718286304]
[54.74437634528357,403.70172585965503,28.904601965220831,104.35025543856511,25.839774380062735,-20.649300371418377,54.74437634528357,83.700955067146737,"-262825.96431476i","-9386641.58267001i","61605.5106259547-240805.377932605i",56874.999999999993,"-6.90902922907904+27.0062106092641i","1+0.375993548465649i","1+0.0000646815851863128i","18.3352109337166-6.89256744405979i","0.999999488080872-0.000821519258520583i","18.3295391706755-6.90762664451376i",25.839774380062735,-20.649300371418377,0.40370172585965503]
[53.857795739873858,443.062145758388,28.126658196847899,103.71909713218351,25.731137543025959,-22.471203447157627,53.857795739873858,81.247893685025872,"-239477.230023748i","-8552758.21513384i","53898.9702996306-220782.62444376i",56874.999999999993,"-6.04474433266886+24.760668161917i","1+0.412652455274404i","1+0.0000709879598921124i","17.8823428600784-7.37770713843106i","0.999999383391636-0.000901616307715493i","17.8756799726067-7.39382560121794i",25.731137543025959,-22.471203447157627,0.44306214575838798]
[52.948710491012619,486.26015800653499,27.344917958331344,103.19938628853377,25.603792532681279,-24.417317296987186,52.948710491012619,78.782068991546595,"-218202.732935341i","-7792954.74769079i","47427.6129058696-202218.402371714i",56874.999999999993,"-5.31898462495734+22.6786993314072i","1+0.452885560241337i","1+0.0000779091983464639i","17.3657104250913-7.86304910683945i","0.999999257293096-0.000989522699612979i","17.3579168618789-7.88022703155913i",25.603792532681279,-24.417317296987186,0.48626015800653499]
[52.01543218929794,533.66992312063098,26.560229030234154,102.78815504492815,25.455203159063785,-26.486600059313457,52.01543218929794,76.301554985614686,"-198818.203533298i","-7100650.12618919i","42003.6877200464-185056.996470227i",56874.999999999993,"-4.71069394991175+20.754055678904i","1+0.497041343274499i","1+0.0000855052490057978i","16.7817325518959-8.33942554123191i","0.999999105406985-0.00108599982881732i","16.772660924365-8.35764303951869i",25.455203159063785,-26.486600059313457,0.533669923120631]
[51.056080103211187,585.70208180566704,25.773355526641154,102.48295167031897,25.282724576570029,-28.675479806136686,51.056080103211187,73.807471864182276,"-181155.74229733i","-6469847.93919035i","37464.8290761-169231.205934173i",56874.999999999993,"-4.20166307395515+18.9792006655147i","1+0.545502260642773i","1+0.0000938419052270395i","16.1284549396438-8.7961448221125i","0.999998922459661-0.00119188332281988i","16.1179535822644-8.81535858037704i",25.282724576570029,-28.675479806136686,0.58570208180566707]
[50.068674886984368,642.80731172843196,24.984998200850534,102.28189434936921,25.083676686133835,-30.977500527857462,50.068674886984368,71.304393821511752,"-165062.365437782i","-5895084.4799208i","33671.6257625504-154666.822608435i",56874.999999999993,"-3.77625709486547+17.3458118813198i","1+0.598688057629114i","1+0.000102991375138192i","15.4060955427994-9.22129013915967i","0.999998702099012-0.00130809027892281i","15.3940132672226-9.24143073465378i",25.083676686133835,-30.977500527857462,0.64280731172843197]
[49.051251969877555,705.48023107186498,24.195814097118173,102.18370726886066,24.855437872759385,-33.383070420634617,49.051251969877555,68.800636848226048,"-150398.679823232i","-5371381.42225827i","30505.0757074911-141286.060599165i",56874.999999999993,"-3.42112998588686+15.8451656746727i","1+0.657059404163389i","1+0.000113032907070598i","14.6175389279167-9.60222600445708i","0.999998436673906-0.00143562720653134i","14.6037308590414-9.62319632962405i",24.855437872759385,-33.383070420634617,0.70548023107186497]
[48.001991136151453,774.26368268112697,23.406435666317456,102.18774197656336,24.595555469833997,-35.879365806989675,48.001991136151453,66.308376169573677,"-137037.675623867i","-4894202.70085239i","27864.0862884473-129010.123315738i",56874.999999999993,"-3.1249442566483+14.4684250447557i","1+0.721121884924922i","1+0.000124053475970073i","13.7686927265003-9.9263096131002i","0.999998116968534-0.00157559874351561i","13.7530269186645-9.94798485650658i",24.595555469833997,-35.879365806989675,0.774263682681127]
[46.919355394027711,849.75343590864497,22.617489549598169,102.29398591774455,24.301865844429543,-38.450438285929152,46.919355394027711,63.843547631815397,"-124863.626213103i","-4459415.22189653i","25663.1188456141-117761.076719917i",56874.999999999993,"-2.87810678642401+13.2068497255982i","1+0.791430378475128i","1+0.000136148536732277i","12.8686148363836-10.1817635610472i","0.99999773188244-0.00172921722201822i","12.850979167952-10.2039930980091i",24.301865844429543,-38.450438285929152,0.84975343590864494]
[45.802228993402238,932.60334688321996,21.829615279798013,102.50305899310231,23.972613713604222,-41.077555901083151,45.802228993402238,61.425503092019163,"-113771.085798905i","-4063253.0642466i","23830.031793444-107463.175016643i",56874.999999999993,"-2.67252693010587+12.0519448616796i","1+0.868593863350155i","1+0.00014942285098736i","11.9293366269816-10.3586216501264i","0.999997268045105-0.00189781316640213i","11.9096453080186-10.3812330029564i",23.972613713604222,-41.077555901083151,0.93260334688322]
[44.650042287279248,1023.53102189903,21.043484160746232,102.81619792598651,23.60655812653302,-43.739781631383053,44.650042287279248,59.076416294603462,"-103663.976102782i","-3702284.86081363i","22304.1463329679-98043.7614109006i",56874.999999999993,"-2.50139958874407+10.9955620273907i","1+0.953280692741642i","1+0.000163991394495082i","10.9653481220014-10.4496228434009i","0.999996709351724-0.00208284681405597i","10.94354707525-10.4724275977684i",23.60655812653302,-43.739781631383053,1.0235310218990299]
[43.462870902529815,1123.3240329780299,20.259818560958568,103.23522716923684,23.203052341571244,-46.414758236207724,43.462870902529815,56.820468933029112,"-94454.7541757011i","-3373384.0777036i","21034.5387500114-89433.8442597396i",56874.999999999993,"-2.35901369159007+10.0299638422138i","1+1.04622438345232i","1+0.000179980353009836i","9.99277075446104-10.4509140137859i","0.999996036404049-0.0022859207585655i","9.96884118586524-10.4737152726886i",23.203052341571244,-46.414758236207724,1.1233240329780299]
[42.241498872635873,1232.84673944207,19.479411797746078,103.76251401784432,22.762087074889799,-49.079634518855237,42.241498872635873,54.682879498989088,"-86063.6541429428i","-3073701.93367653i","19978.5508031993-81568.4291372204i",56874.999999999993,"-2.2405851368074+9.14786121165089i","1+1.14822996926765i","1+0.0001975282152413i","9.02830776049849-10.3624399144867i","0.999995225836891-0.00250879382439113i","9.00226743262156-10.3850406052626i",22.762087074889799,-49.079634518855237,1.2328467394420699]
[40.987439806139221,1353.04777457981,18.703148683674282,104.40090453139626,22.284291122464936,-51.712042873924666,40.987439806139221,52.688861657471598,"-78417.9963102543i","-2800642.72536621i","19100.5025252834-74386.6704189788i",56874.999999999993,"-2.14211243274207+8.34243032736212i","1+1.26018097377338i","1+0.000216786972377373i","8.088112516128-10.1879488550572i","0.999994249506891-0.00275339629273959i","8.06001454488458-10.2101600483447i",22.284291122464936,-51.712042873924666,1.35304777457981]
[39.702915916595146,1484.9682622544599,17.93202664933365,105.15363584473194,21.770889267261495,-54.291028501644632,39.702915916595146,50.862607343087305,"-71451.5576471059i","-2551841.34453949i","18370.5881917486-67831.8919635319i",56874.999999999993,"-2.0602528813176+7.60731498656433i","1+1.38304706301411i","1+0.000237923434559143i","7.18673446279088-9.93461302199836i","0.999993073515419-0.00302184660986438i","7.1566638073046-9.95626141922682i",21.770889267261495,-54.291028501644632,1.48496826225446]
[38.390800445999758,1629.75083462064,17.167177131738054,106.02421953299958,21.223623314261708,-56.797839642070201,38.390800445999758,49.22637989092938,"-65103.9981944816i","-2325142.79266005i","17763.9350139934-61851.5150734763i",56874.999999999993,"-1.99221701091515+6.93661851291324i","1+1.51789244427678i","1+0.000261120675710528i","6.3362839683979-9.61233314762388i","0.999991657031658-0.00331646972166162i","6.30435209314273-9.63326704616178i",21.223623314261708,-56.797839642070201,1.62975083462064]
[37.05453328928801,1788.6495290574401,16.409886613095935,107.0162900345163,20.644646676192075,-59.216513014379224,37.05453328928801,47.799777020137078,"-59320.3384290213i","-2118583.51532219i","17259.8044087484-56396.9228177449i",56874.999999999993,"-1.93567899911197+6.32488854030785i","1+1.66588508374502i","1+0.000286579619237019i","5.54590791620828-9.23284808713333i","0.999989950875046-0.00363981719224036i","5.51224630548576-9.25294139606922i",20.644646676192075,-59.216513014379224,1.78864952905744]
[35.698021551644572,1963.0406500402701,15.66161630026131,108.13341193544436,20.036405251383261,-61.534222482895622,35.698021551644572,46.599189452548735,{"$f":"IMDIV(1,COMPLEX(0,2*PI()*$B67*Cz*10^-9))","v":"-54050.4830566909i"},{"$f":"IMDIV(1,COMPLEX(0,2*PI()*$B67*Cp_Cstray*10^-12))","v":"-1930374.39488181i"},{"$f":"IMDIV(IMPRODUCT(IMDIV(IMPRODUCT(J67,IMSUM(Rz*10^3,I67)),IMSUM(J67,IMSUM(Rz*10^3,I67))),Ro_EA*10^3),IMSUM(IMDIV(IMPRODUCT(J67,IMSUM(Rz*10^3,I67)),IMSUM(J67,IMSUM(Rz*10^3,I67))),Ro_EA*10^3))","v":"16840.9168686704-51423.282620959i"},{"$f":"IF($E$1=\"Feedforward RC\",IMDIV(IMPRODUCT(IMSUM(Rz_2*10^3,IMDIV(1,COMPLEX(0,2*PI()*$B67*Cz_2*10^-12))),RFB_1*10^3),IMSUM(IMSUM(Rz_2*10^3,IMDIV(1,COMPLEX(0,2*PI()*$B67*Cz_2*10^-12))),RFB_1*10^3)),RFB_1*10^3)","v":56874.999999999993},{"$f":"IMPRODUCT(-gm_EA1*10^-6,K67,IMDIV(RFB_2*10^3,IMSUM(L67,RFB_2*10^3)))","v":"-1.88870095723407+5.76709711636924i"},{"$f":"COMPLEX(1,2*PI()*B67*1/(1/(Vreg/Iout_PreReg*Number_Cout*Co*10^-6)+(m_c*(1-Vreg/Vin_nom)-0.5)/(fsw*10^3*L_buck*10^-6*Number_Cout*Co*10^-6)))","v":"1+1.82830682286345i"},{"$f":"COMPLEX(1,2*PI()*B67*(ESR*10^-3*Co*10^-6))","v":"1+0.000314520778328097i"},{"$f":"IMPRODUCT(K,IMDIV(O67,N67))","v":"4.82160347594681-8.80878862765337i"},{"$f":"IMDIV(1,IMSUM(COMPLEX(1,2*PI()*B67/(wn*Qp)),IMPRODUCT(COMPLEX(0,2*PI()*B67/wn),COMPLEX(0,2*PI()*B67/wn))))","v":"0.999987895807851-0.00399468927923487i"},"4.78635674083794-8.82794281209731i",20.036405251383261,-61.534222482895622,1.9630406500402702]
[34.325536145762328,2154.4346900318801,14.924018950313778,109.37884048952945,19.401517195448548,-63.741393347401562,34.325536145762328,45.63744714212789,"-49248.7871113079i","-1758885.25397529i","16492.8830973918-46889.343431658i",56874.999999999993,"-1.84966913241777+5.2586179549523i","1+2.00656448103516i","1+0.000345186165937001i","4.16633751933007-8.35280125016011i","0.999985420478646-0.00438415915509659i","4.12965676605165-8.37094535709451i",19.401517195448548,-63.741393347401562,2.1544346900318803]
[32.94161284893169,2364.4894126454101,14.198950790384487,110.75523147950678,18.742662058547204,-65.831612405958055,32.94161284893169,44.923619073548721,"-44873.6605996842i","-1602630.73570301i","16203.725904338-42757.2194607209i",56874.999999999993,"-1.81724028833697+4.79520218251076i","1+2.20220204081831i","1+0.000378841390981141i","3.58039776722793-7.87683134258373i","0.999982438945297-0.0048115994815551i","3.54243473406261-7.89392045715819i",18.742662058547204,-65.831612405958055,2.3644894126454101]
[31.550962392734622,2595.0242113997401,13.488475898276945,112.26429987860713,18.062486494457676,-67.801381073486667,31.550962392734622,44.462918805120466,"-40887.2082689993i","-1460257.43817855i","15963.479208882-38992.1691728118i",56874.999999999993,"-1.79029673370639+4.37295355209105i","1+2.41691402116439i","1+0.000415777958919475i","3.06188447257834-7.39161062248395i","0.999978847691521-0.00528071156398398i","3.02278674296283-7.40762320159783i",18.062486494457676,-67.801381073486667,2.5950242113997399]
[30.158390141740398,2848.0358684357998,12.794859896068729,113.9064321717794,17.363530245671669,-69.649764870641249,30.158390141740398,44.256667301138151,"-37254.9013762495i","-1330532.19200891i","15763.85227714-35562.3757003379i",56874.999999999993,"-1.76790866659514+3.98830381686033i","1+2.65256015453077i","1+0.000456315796633345i","2.60725549759444-6.906352829044i","0.999974522033506-0.00579555733364393i","2.56716290623913-6.92128736793779i",17.363530245671669,-69.649764870641249,2.8480358684357996]
[28.768722563710458,3125.7158496882398,12.12054950587531,115.68026490075569,16.648173057835148,-71.3779896358798,28.768722563710458,44.302275264875888,"-33945.2786167941i","-1212331.37917122i","15597.9489513129-32438.7329549775i",56874.999999999993,"-1.74930268612855+3.6379887426143i","1+2.91118149499359i","1+0.000500806023480077i","2.21185552255695-6.42863261348523i","0.999969311791945-0.006360594428807i","2.17089771988831-6.44250404618418i",16.648173057835148,-71.3779896358798,3.1257158496882398]
[27.386735567943639,3430.4692863149198,11.468134620693631,117.58225185068218,15.918600947250006,-72.989026168821795,27.386735567943639,44.593225681860389,"-30929.6736215864i","-1104631.20077094i","15460.0331046292-29594.6402956107i",56874.999999999993,"-1.73383548836963+3.31902507988158i","1+3.19501809688169i","1+0.000549633992520871i","1.87038348338112-5.96440701236252i","0.999963036079369-0.00698071467067041i","1.82867852314144-5.97724315791732i",15.918600947250006,-72.989026168821795,3.4304692863149198]
[26.01707919142121,3764.93580679247,10.840290276811107,119.60625345536012,15.176788914610103,-74.48719395991391,26.01707919142121,45.119059495446209,"-28181.9666627972i","-1006498.80938561i","15345.3328574424-27005.8075621004i",56874.999999999993,"-1.72097190924588+3.02868869855332i","1+3.50652841705563i","1+0.000603222628264676i","1.57727468092701-5.51813498787153i","0.99995547702204-0.00766128625681671i","1.53492844421531-5.5299732569053i",15.176788914610103,-74.48719395991391,3.7649358067924701]
[24.664194120355361,4132.0124001153399,10.239697472956484,121.74319268824269,14.424496647398879,-75.877803705743077,24.664194120355361,45.86538898249961,"-25678.3584172292i","-917084.229186754i","15249.8772263447-24650.0715147628i",56874.999999999993,"-1.71026660482371+2.76449400165564i","1+3.84841060888488i","1+0.000662036089837958i","1.32699166133324-5.09295450918462i","0.999946372198773-0.00840820002379458i","1.28409791746289-5.10383899655094i",14.424496647398879,-75.877803705743077,4.1320124001153395]
[23.332218014888674,4534.8785081285796,9.6689442427308574,123.98082917542023,13.663273772157819,-77.166848961111128,23.332218014888674,46.813980214309098,"-23397.1638279639i","-835612.993855857i","15170.3598593109-22507.2241618426i",56874.999999999993,"-1.70134876926851+2.52417467235618i","1+4.22362589236153i","1+0.000726583791309008i","1.11422977928222-4.69088469260415i","0.99993540553465-0.00922792016117314i","1.07087069677673-4.70086371085983i",13.663273772157819,-77.166848961111128,4.5348785081285792]
[22.024883189212645,4977.0235643321103,9.1304116028903604,126.30370413547615,12.894471586322283,-78.36075016910263,22.024883189212645,47.942953966373523,"-21318.6242787732i","-761379.438527614i","15104.0253501575-20558.8530595795i",56874.999999999993,"-1.69390938506439+2.30566576369116i","1+4.63542420277129i","1+0.000797424813988901i","0.934049826224875-4.31302964394713i","0.999922196334212-0.0101275397920737i","0.890296774380898-4.32215370121305i",12.894471586322283,-78.36075016910263,4.9770235643321099]
[20.745411248607876,5462.27721768434,8.6261525141398785,128.69329989151259,12.119258734467998,-79.466149455900918,20.745411248607876,49.227150435611676,"-19424.7364544376i","-693740.587658487i","15048.5743404407-18788.1933913774i",56874.999999999993,"-1.68769058023634+2.10708710931336i","1+5.08737234007812i","1+0.000875172748926349i","0.781952505449921-3.95976900705643i","0.999906286074384-0.0111148418695301i","0.737867019257692-3.96808920000581i",12.119258734467998,-79.466149455900918,5.4622772176843402]
[19.496413908437852,5994.8425031894103,8.1577750425847668,131.12843756221963,11.338638865853083,-80.489751654429554,19.496413908437852,50.638685907790077,"-17699.0964046424i","-632110.585880083i","15002.0842216475-17179.9914434208i",56874.999999999993,"-1.68247673513804+1.92672801234626i","1+5.58338486283926i","1+0.000960501011539833i","0.653909272240979-3.63092694679429i","0.999887122500161-0.0121983658737604i","0.609544085239314-3.63849372138948i",11.338638865853083,-80.489751654429554,5.9948425031894104]
[18.279811421284538,6579.3322465756801,7.7263425809968869,133.5859064908793,10.553468840287652,-81.43820557721412,18.279811421284538,52.147700913665176,"-16126.7574608077i","-575955.623600275i","14962.9427595528-15720.3789703422i",56874.999999999993,"-1.67808703845452+1.7630331555524i","1+6.1277579942387i","1+0.0010541486744198i","0.546362326672007-3.32591618623599i","0.99986404047307-0.0133874808320498i","0.501762404316302-3.33277841142038i",10.553468840287652,-81.43820557721412,6.5793322465756798]
[17.096779992448745,7220.8090183854702,7.3323034936925779,136.04128394326966,9.7644764987561672,-82.318019144898187,17.096779992448745,53.723264798371474,"-14694.1007751955i","-524789.31339984i","14929.7923891187-14396.757868401i",56874.999999999993,"-1.67436923990116+1.61458966748423i","1+6.72520683391719i","1+0.00115692686882187i","0.456204214625423-3.04385695725862i","0.999836238910722-0.0146924652197015i","0.411407743648034-3.05006125648416i",9.7644764987561672,-82.318019144898187,7.2208090183854701]
[15.947736947200521,7924.8289835391797,6.9754595750794559,138.4698713499312,8.9722773721210647,-83.135502213381372,15.947736947200521,55.334369136549824,"-13388.7173609659i","-478168.477177354i","14901.4832840006-13197.6945314383i",56874.999999999993,"-1.67119438699072+1.48011527455383i","1+7.38090619790958i","1+0.00126972581029775i","0.380745106015449-2.78367265050069i","0.999802753021527-0.016124594336326i","0.33578441293927-2.78926293986136i",8.9722773721210647,-83.135502213381372,7.9248289835391796]
[14.832367623653335,8697.4900261778293,6.6549776537453198,140.84765222362401,8.177389969908015,-83.896731541672651,14.832367623653335,56.950920681951359,"-12199.300611469i","-435689.307552466i","14877.0335999148-12112.8232462482i",56874.999999999993,"-1.66845236634559+1.35844746686896i","1+8.1005354404258i","1+0.00139352250931645i","0.31767367388663-2.54416492622338i","0.999762420877407-0.0176962357850585i","0.272576058843392-2.54918211398828i",8.177389969908015,-83.896731541672651,8.6974900261778298]
[13.749692084811192,9545.4845666183501,6.3694426010521941,143.15217278836897,7.3802494837589983,-84.607533103486816,13.749692084811192,58.544639684882156,"-11115.5483678275i","-396983.870279552i","14855.5955347264-11132.7579809439i",56874.999999999993,"-1.6660480973525+1.2485336053395i","1+8.89032764570008i","1+0.00152938923366159i","0.265015718306995-2.32407138748522i","0.999713843173851-0.0194209537109718i","0.21980419941282-2.32855319659115i",7.3802494837589983,-84.607533103486816,9.5454845666183505]
[12.698164206175836,10476.157527896699,6.1169443348083021,145.36326050235206,6.5812198713675336,-85.273477739236284,12.698164206175836,60.089782763115778,"-10128.0736865647i","-361716.91737731i","14836.4260478346-10249.0119261438i",56874.999999999993,"-1.66389824835528+1.14942189825912i","1+9.75712361598466i","1+0.00167850279590197i","0.221093284941067-2.12210886681657i","0.999655334794637-0.0213136224760012i","0.175787254538305-2.1260897485354i",6.5812198713675336,-85.273477739236284,10.476157527896699]
[11.675791793803839,11497.5699539774,5.8951874229078243,147.46352399566771,5.7806043708960146,-85.89988689577774,11.675791793803839,61.563637099889974,"-9228.32353439107i","-329582.983371109i","14818.8612438619-9453.92415937464i",56874.999999999993,"-1.6619283637976+1.0602531767523i","1+10.7084311233063i","1+0.00184215474637906i","0.184485985152045-1.93700511317208i","0.999584866520493-0.0233905504570547i","0.139101783007884-1.94051622624394i",5.7806043708960146,-85.89988689577774,11.497569953977399]
[10.680264847976883,12618.568830660201,5.7016103024944229,149.43861282974399,4.9786545454824607,-86.491845870533027,10.680264847976883,62.946766959210962,"-8408.50470592118i","-300303.739497185i","14802.2935565147-8740.59281380484i",56874.999999999993,"-1.66007030540352+0.980253399679049i","1+11.752489938196i","1+0.00202176255999818i","0.153995474839371-1.76752130479991i","0.999499994888192-0.0256696146461261i","0.108546885541724-1.77059053960865i",4.9786545454824607,-86.491845870533027,12.6185688306602]
[9.7090799026944552,13848.863713938699,5.5335019201387503,151.27724856325759,4.175577982555704,-87.054222549827415,9.7090799026944552,64.223026013430172,"-7661.51632265725i","-273625.582952044i","14786.1509727807-8102.81413966123i",56874.999999999993,"-1.65825992218101+0.90872681940126i","1+12.8983431986397i","1+0.00221888191371808i","0.128613531119214-1.61246742884944i","0.999397777808914-0.0281704066987108i","0.0831122139375869-1.61511946065997i",4.175577982555704,-87.054222549827415,13.8488637139387]
[8.7596509316608095,15199.1108295293,5.3881061505661165,152.97106352428889,3.371544781094693,-87.591690108246951,8.7596509316608095,65.379373416041943,"-6980.88832857618i","-249317.440306292i","14769.8776198972-7535.02684701681i",56874.999999999993,"-1.6564348732595+0.845049739852353i","1+14.1559157374128i","1+0.00243522016108046i","0.107493822840485-1.4707122017676i","0.999274673080049-0.0309143910096711i","0.0619496826089125-1.47296856068657i",3.371544781094693,-87.591690108246951,15.1991108295293]
[7.8294007214536929,16681.0053720006,5.262707764016465,154.51429751686689,2.5666929574372279,-88.108752524018797,7.8294007214536929,66.405544992848093,"-6360.7254495999i","-227168.766057139i","14752.9151021003-7032.26110870333i",56874.999999999993,"-1.65453253481499+0.788664797237757i","1+15.5361000462343i","1+0.00267265112048962i","0.0899272554070921-1.34118887672141i","0.999126416359476-0.0339250752805745i","0.0443487628196883-1.34306802496931i",2.5666929574372279,-88.108752524018797,16.681005372000598]
[6.9158300191099649,18307.3828029537,5.1546971282129306,155.90340584393829,1.7611328908970343,-88.609772075875,6.9158300191099649,67.293633768063287,"-5795.65613155139i","-206987.718983978i","14734.6840254768-6590.09157833919i",56874.999999999993,"-1.65248792809086+0.739075691028695i","1+17.0508506213188i","1+0.00293323130533099i","0.0753206449403643-1.2228980033428i","0.998947874499997-0.0372281938617155i","0.0297151142275953-1.22441541274121i",1.7611328908970343,-88.609772075875,18.3073828029537]
[6.0165645690107983,20092.330025650499,5.0616136519003483,157.1366271252061,0.95495091711045033,-89.0989982314793,6.0165645690107983,68.037628893726804,"-5280.78601432198i","-188599.5005115i","14714.5651922344-6204.59373708052i",56874.999999999993,"-1.65023161034405+0.695842288270713i","1+18.7132875075039i","1+0.00321921773650635i","0.0631784129801637-1.11490797133861i","0.998732869346457-0.0408519038820424i","0.0175522443939866-1.11607619572673i",0.95495091711045033,-89.0989982314793,20.092330025650497]
[5.1293820877820746,22051.307399030498,4.9811699261945686,158.21354984215768,0.14821216158750622,-89.580597527616106,5.1293820877820746,68.632952314541569,"-4811.65553926576i","-171844.840688063i","14691.8799862973-5872.30281955541i",56874.999999999993,"-1.64768747509876+0.658576017146402i","1+20.5378099378022i","1+0.00353308749166907i","0.0530869697559952-1.0163539792464i","0.998473966159986-0.044826993790039i","0.00744586372752395-1.01718271794422i",0.14821216158750622,-89.580597527616106,22.051307399030499]
[4.2522222792226536,24201.282647943801,4.9112595896656428,159.13470546202163,-0.65903731044298897,-90.05868418799885,4.2522222792226536,69.076021274022779,"-4384.20132263575i","-156578.618665563i","14665.8695179109-5590.17448020716i",56874.999999999993,"-1.64477041322365+0.626935455724168i","1+22.5402210526688i","1+0.00387755916048575i","0.0447014566004543-0.926435917360912i","0.998162219732253-0.0491871033774852i","-0.000949394094272075-0.926932066879585i",-0.65903731044298897,-90.05868418799885,24.201282647943803]
[3.3831833220443812,26560.877829466801,4.8499522904980239,159.901205603791,-1.4667689684536427,-90.53735133417679,3.3831833220443812,69.363854269614208,"-3994.72096049797i","-142668.60573207i","14635.6721558566-5355.54624169662i",56874.999999999993,"-1.64138379318018+0.600622008414575i","1+24.7378647792446i","1+0.00425561639175939i","0.037734535910591-0.844415533658468i","0.997786869966638-0.0539689535924895i","-0.00792119827291882-0.844583225697684i",-1.4667689684536427,-90.53735133417679,26.560877829466801]
[2.5205080932771207,29150.530628251799,4.7954789657308163,160.51443225302154,-2.2749708724536957,-91.020702725361659,2.5205080932771207,69.49372952765988,"-3639.84096027964i","-129994.320009987i","14600.2991653118-5166.09861356007i",56874.999999999993,"-1.63741672882002+0.57937554544599i","1+27.1497760561552i","1+0.00467053373636797i","0.0319469431249259-0.769613157718308i","0.997334977213476-0.0592125833985155i","-0.013708979492452-0.769453782150292i",-2.2749708724536957,-91.020702725361659,29.150530628251801]
[1.6625629342219646,31992.671377973798,4.7462102180595007,160.97578394004037,-3.0836472838375362,-91.512885019217251,1.6625629342219646,69.462898920823122,"-3316.48752119045i","-118445.982899659i","14558.6083051598-5019.81458033502i",56874.999999999993,"-1.63274111833568+0.562969859476825i","1+29.7968457050432i","1+0.0051259050098575i","0.0271395448243312-0.701404185097546i","0.996790985937166-0.0649615895117665i","-0.0185118771108109-0.700916397174252i",-3.0836472838375362,-91.512885019217251,31.992671377973799]
[0.80781119515935718,35111.917342151297,4.700630016391603,161.28647697090619,-3.8928188212322459,-92.018120581401732,0.80781119515935718,69.268356389504461,"-3021.85991043051i","-107923.568229661i","14509.2754441536-4914.93593596934i",56874.999999999993,"-1.62720846102657+0.551207768519926i","1+32.702001376872i","1+0.00562567442035328i","0.0231466773315924-0.639215469011007i","0.996136203356624-0.0712633629332781i","-0.0224954006832837-0.638395180494829i",-3.8928188212322459,-92.018120581401732,35.111917342151294]
[4.5216771803520572E-2,38535.2859371054,4.6573063960323733,161.4473988719644,-4.7025231678358939,-92.540740889175837,-4.5216771803520572E-2,68.906657982788559,{"$f":"IMDIV(1,COMPLEX(0,2*PI()*$B99*Cz*10^-9))","v":"-2753.40620458276i"},{"$f":"IMDIV(1,COMPLEX(0,2*PI()*$B99*Cp_Cstray*10^-12))","v":"-98335.9358779554i"},{"$f":"IMDIV(IMPRODUCT(IMDIV(IMPRODUCT(J99,IMSUM(Rz*10^3,I99)),IMSUM(J99,IMSUM(Rz*10^3,I99))),Ro_EA*10^3),IMSUM(IMDIV(IMPRODUCT(J99,IMSUM(Rz*10^3,I99)),IMSUM(J99,IMSUM(Rz*10^3,I99))),Ro_EA*10^3))","v":"14450.7645607871-4849.91469443155i"},{"$f":"IF($E$1=\"Feedforward RC\",IMDIV(IMPRODUCT(IMSUM(Rz_2*10^3,IMDIV(1,COMPLEX(0,2*PI()*$B99*Cz_2*10^-12))),RFB_1*10^3),IMSUM(IMSUM(Rz_2*10^3,IMDIV(1,COMPLEX(0,2*PI()*$B99*Cz_2*10^-12))),RFB_1*10^3)),RFB_1*10^3)","v":56874.999999999993},{"$f":"IMPRODUCT(-gm_EA1*10^-6,K99,IMDIV(RFB_2*10^3,IMSUM(L99,RFB_2*10^3)))","v":"-1.62064649279855+0.543915666665221i"},{"$f":"COMPLEX(1,2*PI()*B99*1/(1/(Vreg/Iout_PreReg*Number_Cout*Co*10^-6)+(m_c*(1-Vreg/Vin_nom)-0.5)/(fsw*10^3*L_buck*10^-6*Number_Cout*Co*10^-6)))","v":"1+35.8904061402693i"},{"$f":"COMPLEX(1,2*PI()*B99*(ESR*10^-3*Co*10^-6))","v":"1+0.00617417073140361i"},{"$f":"IMPRODUCT(K,IMDIV(O99,N99))","v":"0.0198305692949829-0.582521723884722i"},{"$f":"IMDIV(1,IMSUM(COMPLEX(1,2*PI()*B99/(wn*Qp)),IMPRODUCT(COMPLEX(0,2*PI()*B99/wn),COMPLEX(0,2*PI()*B99/wn))))","v":"0.995348177544348-0.0781693136343511i"},"-0.0257970023257396-0.581362078239417i",-4.7025231678358939,-92.540740889175837,38.5352859371054]
[{"$f":"ABS(G100)","v":0.89795599327486553},42292.428743894998,{"$f":"20*LOG(IMABS(M100))","v":4.6148603603449265},{"$f":"IF(180/PI()*IMARGUMENT(M100)>0,180/PI()*IMARGUMENT(M100),360+180/PI()*IMARGUMENT(M100))","v":161.4590107199738},{"$f":"S100","v":-5.5128163536197921},-93.085220574606282,{"$f":"C100+E100","v":-0.89795599327486553},68.373790145367522,"-2508.80118607312i","-89600.0423597544i","14381.2969339285-4823.35755520815i",56874.999999999993,"-1.61285573090787+0.540937295911195i","1+39.3896764319899i","1+0.00677614475565881i","0.0170766787020367-0.530842013451114i","0.994399957124691-0.0857350713636646i",{"$f":"IMPRODUCT(P100,Q100)","v":"-0.0285307293369252-0.529333345682946i"},{"$f":"20*LOG(IMABS(R100))","v":-5.5128163536197921},{"$f":"180/PI()*IMARGUMENT(R100)","v":-93.085220574606282},{"$f":"B100/1000","v":42.292428743894995}]
[1.7518408269810166,46415.888336127799,4.5719338263107829,161.32129554224167,-6.3237746532917996,-93.656212135394384,-1.7518408269810166,67.665083406847288,"-2285.9262032482i","-81640.2215445782i","14298.8209527527-4833.96118454146i",56874.999999999993,"-1.60360608815918+0.542126487985959i","1+43.2301212572798i","1+0.00743681050413779i","0.0147897991056306-0.483736372181013i","0.993259212248962-0.0940206460810716i","-0.0307911020363935-0.481866154436004i",-6.3237746532917996,-93.656212135394384,46.4158883361278]
[2.6083399306787109,50941.380148163902,4.5271572286957991,161.03375110883687,-7.13549715937451,-94.25858130438327,-2.6083399306787109,66.775169804453597,"-2082.85081962824i","-74387.5292724372i","14200.9848192156-4880.435952314i",56874.999999999993,"-1.59263381150082+0.547338611474468i","1+47.4450047119799i","1+0.00816189034749703i","0.0128908114102806-0.440802591138882i","0.991887194073403-0.103090525687868i","-0.0326563400860091-0.43855536578986i",-7.13549715937451,-94.25858130438327,50.941380148163901]
[3.4689918018056183,55908.101825122198,4.4791173075774351,160.59542688859224,-7.9481091093830534,-94.897443009128878,-3.4689918018056183,65.697983879463365,"-1897.81609338988i","-67779.1461924958i","14085.1155207226-4961.41583946085i",56874.999999999993,"-1.57963912381936+0.556420467976918i","1+52.07083410021i","1+0.00895766458046765i","0.0113139764185673-0.401673186344148i","0.990237507744843-0.113013681151144i","-0.0341910415970556-0.399030489096879i",-7.9481091093830534,-94.897443009128878,55.908101825122195]
[4.3354404138678024,61359.072734131798,4.4263256532020723,160.00500642888312,-8.7617660670698747,-95.578197765717192,-4.3354404138678024,64.426808663165929,"-1729.21934225345i","-61757.833651909i","13948.2088268857-5075.35264577807i",56874.999999999993,"-1.56428510208064+0.569198427563896i","1+57.1476761431743i","1+0.00983102581876414i","0.0100046796473651-0.366012558288398i","0.988254672258412-0.123863439374913i","-0.0354484029180546-0.362952834864731i",-8.7617660670698747,-95.578197765717192,61.3590727341318]
[5.2094703102644164,67341.506577508306,4.3671887698171776,159.26093767801626,-9.5766590800815941,-96.30656822960519,-5.2094703102644164,62.954369448411072,"-1575.60026181586i","-56271.4379219951i","13786.9366729178-5220.39357780757i",56874.999999999993,"-1.54619850537396+0.585464700314868i","1+62.7195040179308i","1+0.010789538699624i","0.0089175539210916-0.333514344519467i","0.985872440031286-0.135717171749987i","-0.0364720529329357-0.33001286581394i",-9.5766590800815941,-96.30656822960519,67.341506577508312]
[6.0930402179168075,73907.220335257705,4.2999807420676524,158.36161450010752,-10.39302095998446,-97.088635461907842,-6.0930402179168075,61.272979038199679,"-1435.62827709243i","-51272.4384675868i","13597.6800019414-5394.24302115197i",56874.999999999993,"-1.52497345816165+0.604961834147885i","1+68.8345782320156i","1+0.0118415054030769i","0.00801491718684643-0.30389896248585i","0.983011850442581-0.148655730665534i","-0.0372975637418458-0.29992774483143i",-10.39302095998446,-97.088635461907842,73.907220335257705]
[6.9883138242048499,81113.083078968702,4.2228200307639145,157.305612479101,-11.211133854968764,-97.930874251153242,-6.9883138242048499,59.374738227947759,"-1308.09101771287i","-46717.5363468882i","13376.5966738967-5594.01205839354i",56874.999999999993,"-1.50017906623141+0.62736583832451i","1+75.5458646328724i","1+0.0129960375614562i","0.00726547312642345-0.276911336624219i","0.979578996097878-0.162762546829631i","-0.0379536895235972-0.272439076048453i",-11.211133854968764,-97.930874251153242,81.1130830789687]
[7.8976858511914267,89021.5085445039,4.1336524584728211,156.0919806488088,-12.031338309664248,-98.840186544463378,-7.8976858511914267,57.251794104345421,"-1191.88381694917i","-42567.2791767563i","13119.7349349156-5816.06329137115i",56874.999999999993,"-1.47137214223353+0.65226878034069i","1+82.911493172683i","1+0.0142631351799996i","0.00664323070207097-0.252318801577655i","0.975462489861576-0.178122276546332i","-0.0384633769910871-0.247310833802104i",-12.031338309664248,-98.840186544463378,89.021508544503902]
[8.8238010202687391,97700.995729922506,4.0302430084517304,154.72058756005319,-12.85404402872047,-99.823931672205504,-8.8238010202687391,54.896655887847686,"-1086.00014362086i","-38785.7194150307i","12823.2024665585-6055.86380500785i",56874.999999999993,"-1.43811616447385+0.679162295888732i","1+90.9952614022055i","1+0.0156537732521101i","0.00612660598599043-0.229909172155578i","0.970530637088378-0.194818859890937i","-0.0388445839870461-0.224327473717806i",-12.85404402872047,-99.823931672205504,97.700995729922511]
[9.7695630295689835,107226.722201033,3.9101795488688444,153.19251469323109,-13.679742578437828,-100.88995157793794,-9.7695630295689835,52.302563115293154,"-989.52288400339i","-35340.1030001212i","12483.3982742828-6307.86536050809i",56874.999999999993,"-1.40000728309714+0.707424152580347i","1+99.8671870546391i","1+0.0171799968194992i","0.00569767568450916-0.209488969964845i","0.964628344124881-0.212932818265716i","-0.0391109373092877-0.203292220350682i",-13.679742578437828,-100.88995157793794,107.226722201033]
[10.738130417775148,117681.1952435,3.7708918519499028,151.51048244363261,-14.509022269725051,-102.04658867113611,-10.738130417775148,49.463893772496505,"-901.616398227882i","-32200.5856509959i","12097.3086330665-6565.43725107654i",56874.999999999993,"-1.35670751025045+0.736310719746902i","1+109.60411450573i","1+0.0188550253005749i","0.00534155684982472-0.190881796386429i","0.957573835167992-0.232537584264194i","-0.0392722567332554-0.184025526555577i",-14.509022269725051,-102.04658867113611,117.6811952435]
[11.732896359712369,129154.966501488,3.6096891003754852,149.67928399531007,-15.342585460087854,-103.30269318443672,-11.732896359712369,46.376590810873353,"-821.519282368244i","-29339.9743702944i","11662.8582445513-6820.88206021154i",56874.999999999993,"-1.30798410219267+0.76495873572466i","1+120.290380362998i","1+0.0206933669907212i","0.00504589152592909-0.173926841617646i","0.949155310139865-0.253694620811558i","-0.0393349693969153-0.166363700834571i",-15.342585460087854,-103.30269318443672,129.15496650148799]
[12.757450248189119,141747.41629268101,3.4238182356839495,147.70619133490376,-16.181268483873069,-104.66761602470346,-12.757450248189119,43.038575310200301,"-748.537773524664i","-26733.4919115951i","11179.2937220328-7065.56543177067i",56874.999999999993,"-1.25375256695695+0.792399861506992i","1+132.018543949081i","1+0.0227109447262115i","0.00480041863068762-0.158477519752727i","0.939127762506115-0.276447055298021i","-0.039302437258845-0.150157700127549i",-16.181268483873069,-104.66761602470346,141.74741629268101]
[13.815520537192068,155567.614393047,3.210543820104065,145.60128737170004,-17.026064357296132,-106.15118205259387,-13.815520537192068,39.450105319106171,"-682.039740781286i","-24358.5621707603i","10647.5599970983-7290.18509084423i",56874.999999999993,"-1.19411887817925+0.817590851309634i","1+144.890189006307i","1+0.024925233800198i","0.00459661834424415-0.144400220264689i","0.927210294546084-0.300811536643485i","-0.0391752203005962-0.135272086591637i",-17.026064357296132,-106.15118205259387,155.56761439304699]
[14.910900790806034,170735.26474706901,2.9672475022313467,143.37767150998715,-17.878148293037381,-107.76363752182041,-14.910900790806034,35.614033988166739,"-621.449209990571i","-22194.6146425204i","10070.6146707164-7485.18944472432i",56874.999999999993,"-1.12941472942614+0.839460498473756i","1+159.016803566477i","1+0.0273554133253431i","0.004427416749536-0.13157316672858i","0.913084424454999-0.326768032856246i","-0.0389512995939925-0.121584147477968i",-17.878148293037381,-107.76363752182041,170.73526474706901]
[16.047363992541243,187381.74228603899,2.6915418874161472,141.05148648157441,-18.73890587995739,-109.51556410232011,-16.047363992541243,31.535922379254302,"-566.241374960799i","-20222.9062486i","9453.61599311216-7641.33174653991i",56874.999999999993,"-1.06021861604996+0.856971784658682i","1+174.520745606861i","1+0.0300225323541165i","0.00428694053383727-0.119885374152854i","0.896394077936755-0.35424734443767i","-0.0386262873235663-0.108983176721724i",-18.73890587995739,-109.51556410232011,187.38174228603899]
[17.22857339512603,205651.23083486501,2.3813901200203409,138.64172478093425,-19.609963515146372,-111.41775059673752,-17.22857339512603,27.223974184196734,"-515.938051835909i","-18426.3589941396i","8803.92300290981-7750.31498126453i",56874.999999999993,"-0.987355850793625+0.869194203506303i","1+191.536302856457i","1+0.032949692195618i","0.00417031327850729-0.109235696835231i","0.876748193085047-0.383116243895103i","-0.0381936552392481-0.0973699145798023i",-19.609963515146372,-111.41775059673752,205.651230834865]
[18.458000711639766,225701.97196339199,2.0352195835213922,136.16979485380875,-20.493220295161159,-113.48101230577494,-18.458000711639766,22.688782548033814,"-470.103537295661i","-16789.4120462737i","8130.8656631007-7805.45227991736i",56874.999999999993,"-0.911872784646808+0.875377825785125i","1+210.210855932066i","1+0.036162246508067i","0.0040734862943764-0.0995319592129659i","0.853727125195804-0.413160400940151i","-0.0376450184311653-0.0866561366346001i",-20.493220295161159,-113.48101230577494,225.701971963392]
[19.738863325407291,247707.63559917099,1.6520167350216641,133.65885839486799,-21.390880060428955,-115.71594727266115,-19.738863325407291,17.942911122206837,"-428.340834701956i","-15297.8869536413i","7445.27836304404-7802.24753349001i",56874.999999999993,"-0.834984489313351+0.875018414970843i","1+230.706154878681i","1+0.0396880209000591i","0.00399309815019722-0.0906901627219252i","0.826894280634747-0.444065659563167i","-0.0369705169025914-0.0767643746283623i",-21.390880060428955,-115.71594727266115,247.707635599171]
[21.074090680342906,271858.82427329401,1.2313909499327225,131.13298528350344,-22.305481630275629,-118.1326187292114,-21.074090680342906,13.000366554292043,"-390.288215503843i","-13938.864839423i","6758.835350681-7738.8002127357i",56874.999999999993,"-0.758000226244599+0.867902827596528i","1+253.199720171002i","1+0.0435575539426775i","0.00392635803131743-0.0826337622051303i","0.795814567954635-0.475398837532589i","-0.0361593415729352-0.0676277378115669i",-22.305481630275629,-118.1326187292114,271.85882427329403]
[22.466325896445596,298364.72402833402,0.77359857803259668,128.61620382158461,-23.239924474478194,-120.74015449467358,-22.466325896445596,7.8760493269110299,"-355.616086117878i","-12700.5745042099i","6083.2694895352-7615.96155413793i",56874.999999999993,"-0.682235830602079+0.85412652943603i","1+277.886380310862i","1+0.0478043616799858i","0.003870948888642-0.0752930059139749i","0.760081221735857-0.506590042435326i","-0.0352004515004877-0.0591897840850213i",-23.239924474478194,-120.74015449467358,298.36472402833402]
[23.91796248271816,327454.916287773,0.27952370076724442,126.13154286110816,-24.197486183485406,-123.54625746968476,-23.91796248271816,2.5852853914233975,"-324.024133146168i","-11572.290469506i","5429.58274028546-7437.21251228995i",56874.999999999993,"-0.608925167134819+0.834079907920369i","1+304.979959338505i","1+0.0524652279289679i","0.0038249470219922-0.0686043336205004i","0.71935217824443-0.536919515833977i","-0.0340835216196921-0.0514043655300532i",-24.197486183485406,-123.54625746968476,327.45491628777302]
[25.431209033361327,359381.36638046301,-0.24938181632136619,123.70016377216496,-25.18182721703996,-126.55662737495487,-25.431209033361327,-2.8564636027899155,"-295.238722205396i","-10544.2400787641i","4807.3587290931-7208.28568813051i",56874.999999999993,"-0.539143035038479+0.808405871566039i","1+334.715128874132i","1+0.0575805228833541i","0.00378675531045018-0.0625098278052588i","0.67339627926566-0.565513117262947i","-0.0328001406451753-0.0442353452615231i",-25.18182721703996,-126.55662737495487,359.38136638046302]
[27.008168581836383,394420.60594376602,-0.81119089322115001,121.34066360960769,-26.196977688615235,-129.77430302978294,-27.008168581836383,-8.433639420175254,"-269.010527836683i","-9607.51885131012i","4224.26399598256-6936.59878839003i",56874.999999999993,"-0.473749233194306+0.77793631271664i","1+367.349440731209i","1+0.0631945527809259i","0.00375504777464297-0.056956713301715i","0.622147979389475-0.591351502077885i","-0.0313452425788835-0.037656057235237i",-26.196977688615235,-129.77430302978294,394.42060594376602]
[28.650915296301466,432876.12810830597,-1.4036146874642457,119.06860101734858,-27.247300608837222,-133.19894688711133,-28.650915296301466,-14.130345869762749,"-245.112373967755i","-8754.01335599122i","3685.78318736244-6630.593683218i",56874.999999999993,"-0.413358862134106+0.743617983164636i","1+403.165557707066i","1+0.0693559436629519i","0.00372872354836129-0.0518969011651076i","0.565766853866441-0.613298433197711i","-0.0297186999814829-0.031648366807638i",-27.247300608837222,-133.19894688711133,432.87612810830598]
[30.361550317386381,475081.01621027902,-2.0241239729843916,116.89626130812033,-28.33742634440199,-136.8261086709858,-30.361550317386381,-19.929847362865473,"-223.33726622247i","-7976.33093651678i","3195.1877672897-6299.07782203348i",56874.999999999993,"-0.358338815023144+0.706438634246746i","1+442.473701872824i","1+0.0761180625496955i","0.00370686866290995-0.0472865728919597i","0.504695187517989-0.630152961275991i","-0.0279269351615295-0.0262012000377845i",-28.33742634440199,-136.8261086709858,475.08101621027902]
[32.142220925340531,521400.82879996998,-2.6700665954489922,114.8326449847754,-29.472154329891541,-140.64652121453966,-32.142220925340531,-25.813876229764261,"-203.496599034564i","-7267.73567980584i","2753.70032473885-5950.64695357529i",56874.999999999993,"-0.30882620464361+0.667362275167323i","1+485.614341568569i","1+0.0835394796800144i","0.00368872431837168-0.0430858014471855i","0.439703763719598-0.640727853452841i","-0.0259843271094384-0.0213084574736923i",-29.472154329891541,-140.64652121453966,521.40082879996999]
[33.995092389331639,572236.76593502203,-3.3387718988274577,112.88364063082355,-30.656320490504179,-144.6454962287645,-33.995092389331639,-31.761855597940951,"-185.418522036463i","-6622.09007273078i","2360.79473617406-5593.23858599376i",56874.999999999993,"-0.264762026486811+0.62727909375631i","1+532.961140377226i","1+0.0916844758187478i","0.0036736605408653-0.0392582058603697i","0.371913594914488-0.643952306967165i","-0.0239141279329282-0.0169663226517276i",-30.656320490504179,-144.6454962287645,572.23676593502205]
[35.922268875375615,628029.14418342605,-4.0276364890469178,111.05233098959975,-31.894632386328698,-148.80249705984772,-35.922268875375615,-37.750166070247971,"-168.946451573604i","-6033.8018419144i","2014.56739444319-5233.83434433484i",56874.999999999993,"-0.225932791900171+0.58697207600017i","1+584.924193619778i","1+0.100623599025954i","0.00366115431165783-0.0357706364328239i","0.302781018348433-0.638990863571176i","-0.0217485818338862-0.0131701138813756i",-31.894632386328698,-148.80249705984772,628.02914418342607]
[37.925667536118183,689261.21043497103,-4.7341890687739259,109.33937935477542,-33.191478467344254,-153.0909656065057,-37.925667536118183,-43.751586251730288,"-153.937714451737i","-5497.77551613344i","1712.12264428697-4878.30381399953i",56874.999999999993,"-0.192013754499473+0.547099493158826i","1+641.953580404728i","1+0.110434275710453i","0.0036507714091002-0.0325928878540518i","0.23403658843881-0.625363618810514i","-0.0195279922101393-0.00991098790057587i",-33.191478467344254,-153.0909656065057,689.26121043497108]
[40.006857189781734,756463.32755462895,-5.456134791070343,107.74344929479886,-34.550722398711393,-157.47846849896399,-40.006857189781734,-49.735019204165127,"-140.262312169964i","-5009.36829178441i",{"$f":"IMDIV(IMPRODUCT(IMDIV(IMPRODUCT(J131,IMSUM(Rz*10^3,I131)),IMSUM(J131,IMSUM(Rz*10^3,I131))),Ro_EA*10^3),IMSUM(IMDIV(IMPRODUCT(J131,IMSUM(Rz*10^3,I131)),IMSUM(J131,IMSUM(Rz*10^3,I131))),Ro_EA*10^3))","v":"1449.93059367978-4531.36613370709i"},56874.999999999993,{"$f":"IMPRODUCT(-gm_EA1*10^-6,K131,IMDIV(RFB_2*10^3,IMSUM(L131,RFB_2*10^3)))","v":"-0.162609038543527+0.508190594434441i"},"1+704.543261998035i","1+0.121201481260341i",{"$f":"IMPRODUCT(K,IMDIV(O131,N131))","v":"0.00364215133315961-0.0296974377618456i"},"0.167575162382129-0.603047286309069i","-0.0172986251515389-0.00717294243306331i",-34.550722398711393,-157.47846849896399,756.4633275546289]
[42.166878708970678,830217.56813197501,-6.1913814066415371,106.26162081002693,-35.975497302329138,-161.92720263191725,-42.166878708970678,-55.665581821890328,"-127.801794935915i","-4564.34981913983i","1224.13211786249-4196.63852856351i",56874.999999999993,"-0.137285844993924+0.470651049932357i","1+773.235360279294i","1+0.133018476059154i","0.00363499478927891-0.0270592084959754i","0.105304813297407-0.57253490163548i","-0.0151095588269552-0.00493062628276958i",-35.975497302329138,-161.92720263191725,830.21756813197499]
[44.406067493610159,911162.75611549104,-6.9380504423666522,104.88977728074819,-37.468017051243507,-166.39486448198139,-44.406067493610159,-61.505087201233195,"-116.448235710315i","-4158.86556108267i","1030.78040793975-3876.74103375234i",56874.999999999993,"-0.115601541077355+0.434774695374095i","1+848.624853342105i","1+0.14598761326269i","0.00362905329710262-0.0246553499928144i","0.0489733784858914-0.534835922839201i","-0.0130088398656659-0.00314840385608874i",-37.468017051243507,-166.39486448198139,911.16275611549099]
[46.723898682815253,1000000,-7.6944769193383058,103.62294793826383,-39.029421763476947,-170.83584654889711,-46.723898682815253,-67.212898610633275,"-106.103295394597i","-3789.40340694988i","866.019088242145-3573.43105348184i",56874.999999999993,"-0.0971236360645397+0.400758622820394i","1+931.364728909684i","1+0.160221225333079i","0.00362412056335328-0.0224650419486876i","-0.491408546790877i","-0.0110395136176007-0.00178092381943237i",-39.029421763476947,-170.83584654889711,1000]
[]
[{"$f":"ABS(G136)","v":0.38710681487574128},{"$f":"fc*1000","v":40000},{"$f":"20*LOG(IMABS(M136))","v":4.6402570741507478},{"$f":"IF(180/PI()*IMARGUMENT(M136)>0,180/PI()*IMARGUMENT(M136),360+180/PI()*IMARGUMENT(M136))","v":161.46997683552246},{"$f":"S136","v":-5.0273638890264891},{"$f":"T136","v":-92.75618712112248},{"$f":"C136+E136","v":-0.38710681487574128},{"$f":"D136+F136","v":68.713789714399979},"-2652.58238486492i","-94735.0851737473i",{"$f":"IMDIV(IMPRODUCT(IMDIV(IMPRODUCT(J136,IMSUM(Rz*10^3,I136)),IMSUM(J136,IMSUM(Rz*10^3,I136))),Ro_EA*10^3),IMSUM(IMDIV(IMPRODUCT(J136,IMSUM(Rz*10^3,I136)),IMSUM(J136,IMSUM(Rz*10^3,I136))),Ro_EA*10^3))","v":"14424.3336151352-4834.72057706054i"},{"$f":"IF($E$1=\"Feedforward RC\",IMDIV(IMPRODUCT(IMSUM(Rz_2*10^3,IMDIV(1,COMPLEX(0,2*PI()*$B136*Cz_2*10^-12))),RFB_1*10^3),IMSUM(IMSUM(Rz_2*10^3,IMDIV(1,COMPLEX(0,2*PI()*$B136*Cz_2*10^-12))),RFB_1*10^3)),RFB_1*10^3)","v":56874.999999999993},{"$f":"IMPRODUCT(-gm_EA1*10^-6,K136,IMDIV(RFB_2*10^3,IMSUM(L136,RFB_2*10^3)))","v":"-1.6176822745946+0.542211653502117i"},{"$f":"COMPLEX(1,2*PI()*B136*1/(1/(Vreg/Iout_PreReg*Number_Cout*Co*10^-6)+(m_c*(1-Vreg/Vin_nom)-0.5)/(fsw*10^3*L_buck*10^-6*Number_Cout*Co*10^-6)))","v":"1+37.2545891563874i"},{"$f":"COMPLEX(1,2*PI()*B136*(ESR*10^-3*Co*10^-6))","v":"1+0.00640884901332318i"},{"$f":"IMPRODUCT(K,IMDIV(O136,N136))","v":"0.0186645153302321-0.561222329467898i"},{"$f":"IMDIV(1,IMSUM(COMPLEX(1,2*PI()*B136/(wn*Qp)),IMPRODUCT(COMPLEX(0,2*PI()*B136/wn),COMPLEX(0,2*PI()*B136/wn))))","v":"0.99498887687695-0.0811205598145681i"},{"$f":"IMPRODUCT(P136,Q136)","v":"-0.0269556844009916-0.559924051207785i"},{"$f":"20*LOG(IMABS(R136))","v":-5.0273638890264891},{"$f":"180/PI()*IMARGUMENT(R136)","v":-92.75618712112248},40]
[null,null,{"$f":"20*LOG(IMABS((-gm_EA1*10^-6*Rz*10^3)))","v":21.474367006922456}]

{"sheet":"Control Loop2","index":2,"n_rows":141,"n_cols":21,"rows_kept":141,"cut":false,"hidden":false,"merged":[[31,16,31,17],[0,1,0,2],[0,4,0,5],[31,2,31,3],[31,4,31,5],[31,6,31,7],[31,14,31,15]]}
[null,"Series RC with Parallel C",null,null,"No feedforward C"]
[null,"Rz",{"$f":"Rz_adj","v":10},"kΩ","Cz2",39,"pF"]
[null,"Cz",{"$f":"Cz_adj","v":1.5},"nF","Rz2",0,"kΩ"]
[null,"Cp",{"$f":"Cp_adj","v":39},"pF"]
[null,null,null,null,"AVOL2",60,"dB"]
[null,"Ro_EA",1300,"kΩ",null,{"$f":"10^(F5/20)","v":1000},"V/V"]
[null,"Cstray",15,"pF","gm_EA2",750,"uA/V"]
[]
[null,"Cp +Cstray",{"$f":"IF(Type=RCC,C4+Cstray_adj,IF(Type=RCRC,C4+Cstray_adj,Cstray_adj))","v":54},"pF"]
[null,null,null,null,"FB gain",{"$f":"RFB2_adj/(RFB1_adj+RFB2_adj)","v":0.24242424242424243}]
[null,null,null,null,"VFB",0.8,"V"]
[null,"Series RC"]
[null,"Series RC with Parallel C",null,null,"Ri",{"$f":"1/gm_POWER2","v":0.4}]
[null,null,null,null,"gmPOWER2",2.5,"A/V"]
[null,null,null,null,"K",{"$f":"Vout_sync_buck/(Iout_sync_buck*Ri_adj*(1+Vout_sync_buck*(mc_adj*(1-Vout_sync_buck/Vreg)-0.5)/(Iout_sync_buck*fsw*10^3*L_buck2*10^-6)))","v":8.6556675045367939}]
[null,null,null,null,"mc",{"$f":"(1+Se_adj/Sn_adj)","v":2.4432439024390247}]
[null,"No feedforward C",null,null,"Se (Slope Comp)",{"$f":"0.000306*fsw+0.0175","v":0.62949999999999995},"A/us"]
[null,"Feedforward RC",null,null,"Sn (Inductor)",{"$f":"(Vreg-Vout_sync_buck)/L_buck2","v":0.43617021276595741},"A/us"]
[null,null,null,null,"wn",{"$f":"PI()*fsw*10^3","v":6283185.307179586}]
[null,"Calculated",null,null,"Qp",{"$f":"1/(PI()*(mc_adj*(1-Vout_sync_buck/Vreg)-0.5))","v":0.72974006002754455}]
["fco2",{"$f":"VLOOKUP(MIN(A34:A133),A34:H133,2,FALSE)/1000","v":42.292428743894995}]
["PM2",{"$f":"VLOOKUP(MIN(A34:A133),A34:H133,8,FALSE)","v":68.915645666888111}]
[null,null,null,null,"wp",{"$f":"(1/(Vout_sync_buck/Iout_sync_buck*Number_Cout2*Co_2*10^-6)+(mc_adj*(1-Vout_sync_buck/Vreg)-0.5)/(fsw*10^3*L_buck2*10^-6*Number_Cout2*Co_2*10^-6))/(1000)","v":16.989888238236059},"Rad"]
[null,null,null,null,"wz",{"$f":"1/(ESR_2*10^-3*Co_2*10^-6*1000)","v":39215.686274509804},"Rad"]
[]
[]
[]
[]
[]
[]
[]
[null,null,"Error Amplifier",null,"Control to Output",null,"Total System",null,"Error Amp"]
["Calculated","Frequency","Gain","Phase","Gain","Phase","Gain","Phase","ZCz","ZCp","ZT(s)","RFB1 with or without feedforward C","Tv(s)","1 + s/ωP","1 + s/ωZ","fp(s)","fh(s)","fp(s)fh(s)","Gain","Phase","Freq (kHz)"]
[{"$f":"ABS(G34)","v":62.005290117845341},100,{"$f":"20*LOG(IMABS(M34))","v":43.265214427533358},{"$f":"IF(180/PI()*IMARGUMENT(M34)>0,180/PI()*IMARGUMENT(M34),360+180/PI()*IMARGUMENT(M34))","v":128.55423402401266},{"$f":"S34","v":18.740075690311983},{"$f":"T34","v":-2.1248757469080592},{"$f":"C34+E34","v":62.005290117845341},{"$f":"D34+F34","v":126.4293582771046},{"$f":"IMDIV(1,COMPLEX(0,2*PI()*$B34*Cz_adj*10^-9))","v":"-1061032.95394597i"},{"$f":"IMDIV(1,COMPLEX(0,2*PI()*$B34*Cp_Cstray_adj*10^-12))","v":"-29473137.6096102i"},{"$f":"IMDIV(IMPRODUCT(IMDIV(IMPRODUCT(J34,IMSUM(Rz_adj*10^3,I34)),IMSUM(J34,IMSUM(Rz_adj*10^3,I34))),Ro_adj*10^3),IMSUM(IMDIV(IMPRODUCT(J34,IMSUM(Rz_adj*10^3,I34)),IMSUM(J34,IMSUM(Rz_adj*10^3,I34))),Ro_adj*10^3))","v":"499216.904698936-626383.731923794i"},{"$f":"IF($E$1=\"Feedforward RC\",IMDIV(IMPRODUCT(IMSUM(Rz_2_adj*10^3,IMDIV(1,COMPLEX(0,2*PI()*$B34*Cz_2_adj*10^-12))),RFB1_adj*10^3),IMSUM(IMSUM(Rz_2_adj*10^3,IMDIV(1,COMPLEX(0,2*PI()*$B34*Cz_2_adj*10^-12))),RFB1_adj*10^3)),RFB1_adj*10^3)","v":4750},{"$f":"IMPRODUCT(-gm_EA2*10^-6,K34,IMDIV(RFB2_adj*10^3,IMSUM(L34,RFB2_adj*10^3)))","v":"-90.7667099452609+113.887951258871i"},{"$f":"COMPLEX(1,2*PI()*B34*1/(1/(Vout_sync_buck/Iout_sync_buck*Number_Cout2*Co_2*10^-6)+(mc_adj*(1-Vout_sync_buck/Vreg)-0.5)/(fsw*10^3*L_buck2*10^-6*Number_Cout2*Co_2*10^-6)))","v":"1+0.0369819107640694i"},{"$f":"COMPLEX(1,2*PI()*B34*(ESR_2*10^-3*Co_2*10^-6))","v":"1+0.0000160221225333079i"},{"$f":"IMPRODUCT(K_adj,IMDIV(O34,N34))","v":"8.643850769425-0.319527435647443i"},{"$f":"IMDIV(1,IMSUM(COMPLEX(1,2*PI()*B34/(wn_adj*Qp_adj)),IMPRODUCT(COMPLEX(0,2*PI()*B34/wn_adj),COMPLEX(0,2*PI()*B34/wn_adj))))","v":"0.999999991221382-0.000137035097289799i"},{"$f":"IMPRODUCT(P34,Q34)","v":"8.6438069070707-0.32071194377358i"},{"$f":"20*LOG(IMABS(R34))","v":18.740075690311983},{"$f":"180/PI()*IMARGUMENT(R34)","v":-2.1248757469080592},{"$f":"B34/1000","v":0.1}]
[{"$f":"ABS(G35)","v":61.485399298914707},109.74987654930599,{"$f":"20*LOG(IMABS(M35))","v":42.746536464371403},{"$f":"IF(180/PI()*IMARGUMENT(M35)>0,180/PI()*IMARGUMENT(M35),360+180/PI()*IMARGUMENT(M35))","v":126.05044403198404},{"$f":"S35","v":18.738862834543305},-2.3318320931436878,{"$f":"C35+E35","v":61.485399298914707},123.71861193884035,"-966773.710646764i","-26854825.2957435i","444052.156403247-610055.152979744i",4750,"-80.7367557096811+110.91911872359i","1+0.0405876014091407i","1+0.000017584259700884i","8.64143817964829-0.350583044932011i","0.999999989426123-0.000150395850142341i",{"$f":"IMPRODUCT(P35,Q35)","v":"8.6413853620397-0.35188267766647i"},{"$f":"20*LOG(IMABS(R35))","v":18.738862834543305},{"$f":"180/PI()*IMARGUMENT(R35)","v":-2.3318320931436878},{"$f":"B35/1000","v":0.109749876549306}]
[60.93172241110382,120.450354025878,42.194320016069405,123.62784510777983,18.737402395034419,-2.5588968601124766,60.93172241110382,121.06894824766735,"-880888.198732913i","-24469116.6314697i","392128.781595321-589579.431902792i",4750,"-71.2961421082401+107.196260345962i","1+0.0445448424408559i","1+0.0000192987033138294i","8.63853399494124-0.384635092565482i","0.999999987263729-0.000165059259916157i","8.63847039733481-0.386060957694631i",18.737402395034419,-2.5588968601124766,0.120450354025878]
[60.346419025902748,132.19411484660299,41.610775083638558,121.30255178176984,18.73564394226419,-2.8080082598129992,60.346419025902748,118.49454352195684,"-802632.518987084i","-22295347.7496412i","343981.260189018-565693.026509666i",4750,"-62.5420473070941+102.853277547212i","1+0.0488879095879222i","1+0.0000211803030625446i","8.63503848593525-0.421965651127677i","0.999999984659116-0.000181152334056826i","8.63496191340353-0.423529902030749i",18.73564394226419,-2.8080082598129992,0.13219411484660298]
[59.731912879348414,145.08287784959401,40.998386054811974,119.08756921475788,18.733526824536437,-3.0812863241010047,59.731912879348414,116.00628289065688,"-731328.85814819i","-20314690.5041164i","299949.766101221-539178.613501405i",4750,"-54.5363211093128+98.0324751820735i","1+0.0536544204202807i","1+0.0000232453564639114i","8.63083188853843-0.46288107864783i","0.99999998152185-0.000198814463080333i","8.6307397016035-0.4645970043025i",18.733526824536437,-3.0812863241010047,0.14508287784959401]
[59.090770574475158,159.228279334109,40.359792456259015,116.99271883717783,18.730978118216143,-3.3810483506604432,59.090770574475158,113.61167048651738,"-666359.6180171i","-18509989.3893639i","260190.085105597-510812.260689249i",4750,"-47.3072882010176+92.8749564889542i","1+0.0588856601745034i","1+0.0000255117500225888i","8.62577046772509-0.507713367280072i","0.999999977743003-0.000218198627907549i","8.62565949338123-0.5095954872606i",18.730978118216143,-3.3810483506604432,0.15922827933410899]
[58.425590620306323,174.752840000768,39.697680443355495,115.0247622955565,18.727910176950825,-3.7098251332941268,58.425590620306323,111.31493716226237,"-607162.066116524i","-16865612.9476812i","224696.991294812-481321.044159048i",4750,"-40.8539984172385+87.5129171198268i","1+0.064626939346761i","1+0.0000279991141553586i","8.61968184783507-0.556821304945864i","0.999999973191368-0.000239472724912466i","8.61954827323801-0.558885468718226i",18.727910176950825,-3.7098251332941268,0.17475284000076802]
[57.73890939926288,191.79102616724899,39.014691693339415,113.18767484548131,18.724217705923465,-4.0703778281632399,57.73890939926288,109.11729701731807,"-553223.461571507i","-15367318.3769863i","193335.418508998-451353.451416891i",4750,"-35.1518942743632+82.06426389398i","1+0.070927986150665i","1+0.0000307289932204053i","8.61235949080263-0.610591334740132i","0.999999967708909-0.000262821020161166i","8.61219873646265-0.612854824130839i",18.724217705923465,-4.0703778281632399,0.191791026167249]
[57.0331271747758,210.49041445120201,38.313352899184679,111.48301487702858,18.719774275591124,-4.4657152251081778,57.0331271747758,107.0172996519204,"-504076.613993246i","-14002128.1664791i","165874.179146246-421462.489852252i",4750,"-30.1589416629538+76.6295436095002i","1+0.0778433772392634i","1+0.0000337250321242393i","8.60355619305954-0.669437957670888i","0.999999961105266-0.000288445745437522i","8.60336276189579-0.671919590812797i",18.719774275591124,-4.4657152251081778,0.21049041445120201]
[56.310454299888264,231.01297000831599,37.596026122968723,109.91034032953804,18.71442817691954,-4.8991110832521194,56.310454299888264,105.01122924628592,"-459295.83689945i","-12758217.6916514i","142018.170091329-392099.751808253i",4750,"-25.8214854711507+71.2908639651368i","1+0.0854330104219019i","1+0.0000370131811225663i","8.59297646468862-0.733803474073819i","0.999999953151153-0.00031656884987974i","8.59274376279576-0.736523708372442i",18.71442817691954,-4.8991110832521194,0.231012970008316]
[55.572875686989605,253.53644939701101,36.864878179705315,108.46763197326972,18.70799750728429,-5.3741210452268318,55.572875686989605,103.09351092804289,"-418493.260621673i","-11624812.7950465i","121436.458902021-363617.851755495i",4750,"-22.0793561640038+66.1123366828172i","1+0.0937626234703926i","1+0.0000406219205889874i","8.58026765371364-0.804156795452327i","0.999999943570398-0.000347433922399695i","8.57998777818288-0.807137826120248i",18.70799750728429,-5.3741210452268318,0.25353644939701103]
[54.822130389651591,278.255940220713,36.121866025879527,107.15169471555409,18.700264363772067,-5.8945984555780662,54.822130389651591,101.25709625997602,"-381315.4727638i","-10592096.4656611i","103784.987604487-336278.501938076i",4750,"-18.8699977462703+61.1415458069228i","1+0.102904363508146i","1+0.0000445825076983707i","8.56500968857803-0.880990979081074i","0.999999932030343-0.000381308301536298i","8.56467317724336-0.884256828497413i",18.700264363772067,-5.8945984555780662,0.27825594022071298]
[54.059702691266125,305.38555088334198,35.368734681395651,105.9585188726798,18.690968009870478,-6.4647081657422572,54.059702691266125,99.493810706937552,"-347440.457112945i","-9651123.80869288i","88723.6663520908-310263.792191223i",4750,"-16.1315757003801+56.4115985802223i","1+0.112937411914039i","1+0.0000489292471615465i","8.54670333916805-0.964819040228033i","0.999999918130307-0.000418485391017663i","8.54629887677876-0.968395631727398i",18.690968009870478,-6.4647081657422572,0.30538555088334196]
[53.286821177675378,335.16026509388399,34.607024303205527,104.88359237483967,18.679796874469847,-7.0889370987914297,53.286821177675378,97.794655276048232,"-316574.804489057i","-8793744.56914045i","75928.3031976535-285688.756410083i",4750,"-13.805146035937+51.9434102563786i","1+0.123948670153639i","1+0.0000536997883563018i","8.52475694995399-1.05616747981672i","0.999999901387662-0.000459287201088637i","8.52427102510209-1.06008268742508i",18.679796874469847,-7.0889370987914297,0.33516026509388397]
[52.504462678974861,367.83797718286303,33.838083437307198,103.92216162223433,18.666379241667659,-7.7720999598216878,52.504462678974861,96.150061662412639,"-288451.171374971i","-8012532.53819368i","65098.170871017-262613.869556042i",4750,"-11.8360310674576+47.7479762829166i","1+0.136033512478124i","1+0.0000589354514282796i","8.49847168988483-1.15556682899914i","0.999999881221086-0.000504067137615851i","8.49788819718177-1.159850492041i",18.666379241667659,-7.7720999598216878,0.36783797718286304]
[51.713358528191293,403.70172585965503,33.063086027892197,103.0694432376558,18.650272500299092,-8.5193380013699418,51.713358528191293,94.550105236285859,"-262825.96431476i","-7300721.23096557i","55960.1286026961-241056.621480488i",4750,"-10.1745688368538+43.8284766328159i","1+0.149296612010426i","1+0.0000646815851863128i","8.46702550825942-1.26353835989394i","0.999999856930373-0.000553213063128651i","8.46632529095878-1.26822224823699i",18.650272500299092,-8.5193380013699418,0.40370172585965503]
[50.91400118618445,443.062145758388,32.283050336875718,102.32079161903394,18.630950849308736,-9.3361081801928041,50.91400118618445,92.984683438841131,"-239477.230023748i","-6652145.27843747i","48270.1824442307-221001.711215812i",4750,"-8.77639680804193+40.1821293119658i","1+0.163852847373738i","1+0.0000709879598921124i","8.42945620368617-1.38057595260854i","0.999999827672121-0.000607150656309873i","8.42861653346015-1.38569366456322i",18.630950849308736,-9.3361081801928041,0.44306214575838798]
[50.106649859123095,486.26015800653499,31.49885845217559,101.67182844246085,18.607791406947506,-10.228159372796062,50.106649859123095,91.443669069664793,"-218202.732935341i","-6061187.02598171i","41813.2520788643-202409.690277411i",4750,"-7.6024094688844+36.8017618686201i","1+0.1798282977152i","1+0.0000779091983464639i","8.38464432796176-1.50712196032834i","0.999999792430448-0.000666347099035621i","8.38363832121874-1.51270873092009i",18.607791406947506,-10.228159372796062,0.48626015800653499]
[49.291334263749945,533.66992312063098,30.711275505190358,101.11854054198703,18.580058758559584,-11.201491567605899,49.291334263749945,89.917048974381132,"-198818.203533298i","-5522727.87592494i","36401.7659801046-185224.069374859i",4750,"-6.61850290547355+33.6771035227016i","1+0.19736133474315i","1+0.0000855052490057978i","8.33129708384971-1.64353580760501i","0.999999749981725-0.000731315122900567i","8.33009305828205-1.64962820024182i",18.580058758559584,-11.201491567605899,0.533669923120631]
[48.467856180463741,585.70208180566704,29.920968068468504,100.65735226071351,18.546888111995237,-12.262293161459008,48.467856180463741,88.395059099254496,"-181155.74229733i","-5032103.95270359i","31873.5609757269-169377.011307898i",4750,"-5.79519290467761+30.7958202377996i","1+0.216603821236669i","1+0.0000938419052270395i","8.26793495892561-1.79005404150989i","0.999999698852081-0.000802617450279357i","8.26649574044354-1.79668949131465i",18.546888111995237,-12.262293161459008,0.58570208180566707]
[47.635788895432086,642.80731172843196,29.128521469587824,100.28517769958356,18.507267425844262,-13.41685073471333,47.635788895432086,86.868326964870221,"-165062.365437782i","-4585065.70660507i","28089.4331194887-154793.78577454i",4750,"-5.10716965808885+28.14432468628i","1+0.237722426408322i","1+0.000102991375138192i","8.19288358056721-1.94674070495431i","0.999999637266233-0.000880871668392499i","8.19116577999899-1.95395687783428i",18.507267425844262,-13.41685073471333,0.64280731172843197]
[46.79447509812163,705.48023107186498,28.334455949672655,99.999457471081712,18.460019148448975,-14.671425094597398,46.79447509812163,85.328032376484316,"-150398.679823232i","-4177741.10620087i","24930.5806908142-141396.178190604i",4750,"-4.5328328528753+25.7083960346552i","1+0.260900069513148i","1+0.000113032907070598i","8.10427417008119-2.11342731906712i","0.999999563085847-0.00096675557859621i","8.10222746155844-2.12126124794521i",18.460019148448975,-14.671425094597398,0.70548023107186497]
[45.94302429654158,774.26368268112697,27.539241729578873,99.79818371027558,18.403782566962704,-16.03208716472319,45.94302429654158,83.766096545552386,"-137037.675623867i","-3806602.10066297i","22296.0976846248-129105.038871311i",4750,"-4.05383594265905+23.4736434311474i","1+0.286337504207732i","1+0.000124053475970073i","8.0000569630317-2.28964257867341i","0.999999473735288-0.00106101306723269i","7.99762341218876-2.2981295386917i",18.403782566962704,-16.03208716472319,0.774263682681127]
[45.080311356932597,849.75343590864497,26.743313137585595,99.679916268893408,18.336998219347006,-17.504507751900285,45.080311356932597,82.175408516993116,"-124863.626213103i","-3468434.06147508i","20100.6148544163-117842.141298067i",4750,"-3.6546572462575+21.4258438723758i","1+0.314255057382349i","1+0.000136148536732277i","7.87803292188885-2.47453323146303i","0.999999366112194-0.00116446054889602i","7.87514643177487-2.48370532142703i",18.336998219347006,-17.504507751900285,0.84975343590864494]
[44.204978366762397,932.60334688321996,25.94708201127294,99.643792246929323,18.257896355489457,-19.093696722486726,44.204978366762397,80.550095524442597,"-113771.085798905i","-3160307.93885848i","18272.1415792768-107531.495452081i",4750,"-3.3222075598685+19.5511809912874i","1+0.344894537527077i","1+0.00014942285098736i","7.73590976487846-2.66677966619323i","0.999999236479752-0.00127799403792824i","7.73249572984085-2.67666407661042i",18.257896355489457,-19.093696722486726,0.93260334688322]
[43.315442628633349,1023.53102189903,25.150950622371017,99.689530304451722,18.164492006262336,-20.803690120713132,43.315442628633349,78.885840183738594,"-103663.976102782i","-2879554.89174394i","16750.1317474464-98100.2385002823i",4750,"-3.0454784995357+17.8364070000513i","1+0.378521329161267i","1+0.000163991394495082i","7.57138840726777-2.86451254853085i","0.999999080336951-0.00140259690940373i","7.5673636876941-2.87512952012443i",18.164492006262336,-20.803690120713132,1.0235310218990299]
[42.409914143808194,1123.3240329780299,24.355324393280505,99.817430532992958,18.054589750527693,-22.637188711260684,42.409914143808194,77.180241821732267,"-94454.7541757011i","-2623743.17154725i","15483.777074073-89479.2028050645i",4750,"-2.81523219528599+16.2689459645572i","1+0.415426691467281i","1+0.000179980353009836i","7.38228485818114-3.06524032401019i","0.999998892262302-0.00153934841683439i","7.37755820770592-3.07660083703699i",18.054589750527693,-22.637188711260684,1.1233240329780299]
[41.486426309456164,1232.84673944207,23.560624681748799,100.02837003187112,17.925801627707369,-24.595158641602993,41.486426309456164,75.433211390268127,"-86063.6541429428i","-2390657.05952619i","14430.5189702548-81603.2414368025i",4750,"-2.6237307218645+14.8369529885095i","1+0.455930281038206i","1+0.0001975282152413i","7.16668985433785-3.26580118084802i","0.999998665725587-0.00168943304038625i","7.16116293958869-3.27790446600319i",17.925801627707369,-24.595158641602993,1.2328467394420699]
[40.542883549959882,1353.04777457981,22.76730190754547,100.32379370670212,17.775581642414412,-26.676414358514819,40.542883549959882,73.6473793481873,"-78417.9963102543i","-2178277.67528483i","13554.76303135-74411.3744939379i",4750,"-2.46450236933636+13.5293408170796i","1+0.500382920590333i","1+0.000216786972377373i","6.92316352323577-3.46235634752896i","0.999998392861115-0.00185415074659592i","6.91673266614371-3.47518737185685i",17.775581642414412,-26.676414358514819,1.35304777457981]
[39.577129008493898,1484.9682622544599,21.975849281322493,100.70569916113803,17.601279727171402,-28.877214913654552,39.577129008493898,71.828484247483473,"-71451.5576471059i","-1984765.49019738i","12826.7767360655-67846.805548886i",4750,"-2.33214122473918+12.3357828270702i","1+0.549169637621697i","1+0.000237923434559143i","6.65095496667603-3.65044314274662i","0.99999806419461-0.00203492824847643i","6.64351370185093-3.66397029234014i",17.601279727171402,-28.877214913654552,1.48496826225446]
[38.587034029498355,1629.75083462064,21.186817368325684,101.176613866762,17.400216661172667,-31.190915802598234,38.587034029498355,69.985698064163756,"-65103.9981944816i","-1808444.39429115i","12221.7498158412-61856.8461868707i",4750,"-2.22213633015294+11.2466993067037i","1+0.602712999336082i","1+0.000261120675710528i","6.35022735699799-3.82510440305479i","0.999997668314228-0.00223333136357483i","6.34166982463092-3.83927764603549i",17.400216661172667,-31.190915802598234,1.62975083462064]
[37.570608847300164,1788.6495290574401,20.400829672919805,101.73956205442109,17.169779174380363,-33.607726953191289,37.570608847300164,68.131835101229797,"-59320.3384290213i","-1647787.17858393i","11718.997092362-56392.7775418725i",4750,"-2.13072674406581+10.2532322803404i","1+0.66147677271797i","1+0.000286579619237019i","6.02225951362693-3.98110424964635i","0.999997191474309-0.00245107857706437i","6.012484600617-3.99585409989216i",17.169779174380363,-33.607726953191289,1.78864952905744]
[36.526130741899365,1963.0406500402701,19.618599356130098,102.39801796868484,16.907531385769268,-36.114630116831158,36.526130741899365,66.283387851853689,{"$f":"IMDIV(1,COMPLEX(0,2*PI()*$B66*Cz_adj*10^-9))","v":"-54050.4830566909i"},{"$f":"IMDIV(1,COMPLEX(0,2*PI()*$B66*Cp_Cstray_adj*10^-12))","v":"-1501402.3071303i"},{"$f":"IMDIV(IMPRODUCT(IMDIV(IMPRODUCT(J66,IMSUM(Rz_adj*10^3,I66)),IMSUM(J66,IMSUM(Rz_adj*10^3,I66))),Ro_adj*10^3),IMSUM(IMDIV(IMPRODUCT(J66,IMSUM(Rz_adj*10^3,I66)),IMSUM(J66,IMSUM(Rz_adj*10^3,I66))),Ro_adj*10^3))","v":"11301.2847834744-51409.6705926827i"},{"$f":"IF($E$1=\"Feedforward RC\",IMDIV(IMPRODUCT(IMSUM(Rz_2_adj*10^3,IMDIV(1,COMPLEX(0,2*PI()*$B66*Cz_2_adj*10^-12))),RFB1_adj*10^3),IMSUM(IMSUM(Rz_2_adj*10^3,IMDIV(1,COMPLEX(0,2*PI()*$B66*Cz_2_adj*10^-12))),RFB1_adj*10^3)),RFB1_adj*10^3)","v":4750},{"$f":"IMPRODUCT(-gm_EA2*10^-6,K66,IMDIV(RFB2_adj*10^3,IMSUM(L66,RFB2_adj*10^3)))","v":"-2.0547790515408+9.3472128350332i"},{"$f":"COMPLEX(1,2*PI()*B66*1/(1/(Vout_sync_buck/Iout_sync_buck*Number_Cout2*Co_2*10^-6)+(mc_adj*(1-Vout_sync_buck/Vreg)-0.5)/(fsw*10^3*L_buck2*10^-6*Number_Cout2*Co_2*10^-6)))","v":"1+0.725969941460301i"},{"$f":"COMPLEX(1,2*PI()*B66*(ESR_2*10^-3*Co_2*10^-6))","v":"1+0.000314520778328097i"},{"$f":"IMPRODUCT(K_adj,IMDIV(O66,N66))","v":"5.66958770873381-4.11322786973305i"},{"$f":"IMDIV(1,IMSUM(COMPLEX(1,2*PI()*B66/(wn_adj*Qp_adj)),IMPRODUCT(COMPLEX(0,2*PI()*B66/wn_adj),COMPLEX(0,2*PI()*B66/wn_adj))))","v":"0.999996617118071-0.00269005592740553i"},"5.65850371617626-4.12846546319064i",16.907531385769268,-36.114630116831158,1.9630406500402702]
[35.452282303443752,2154.4346900318801,18.840947087010747,103.15584127999441,16.611335216433009,-38.695502434167999,35.452282303443752,64.460338845826413,"-49248.7871113079i","-1368021.864203i","10954.2629350007-46866.1814162892i",4750,"-1.99168417000012+8.52112389387075i","1+0.796751114537746i","1+0.000345186165937001i","5.29605010117524-4.2166460040796i","0.999995925302691-0.00295233334358401i","5.28357957677821-4.23226452782646i",16.611335216433009,-38.695502434167999,2.1544346900318803]
[34.348289049246404,2364.4894126454101,18.068819866603036,104.01718960034655,16.279469182643371,-41.331475318560834,34.348289049246404,62.685714281785721,"-44873.6605996842i","-1246490.57221345i","10665.9884798193-42724.3332987968i",4750,"-1.93927063269441+7.76806059978122i","1+0.874433364610395i","1+0.000378841390981141i","4.90670377431865-4.28730636540669i","0.999995092006788-0.00324018257553064i","4.89278803686868-4.30318393940899i",16.279469182643371,-41.331475318560834,2.3644894126454101]
[33.214043350198388,2595.0242113997401,17.303310435859572,104.98640228558502,15.910732914338816,-44.001529654519686,33.214043350198388,60.984872631065329,"-40887.2082689993i","-1135755.78524998i","10426.5252869568-38949.2943144516i",4750,"-1.89573187035578+7.08168987535482i","1+0.959689538165848i","1+0.000415777958919475i","4.5076018717333-4.32229952275112i","0.999994088296277-0.00355609687316038i","4.49220470830882-4.33830343951846i",15.910732914338816,-44.001529654519686,2.5950242113997399]
[32.050201277831619,2848.0358684357998,16.545676571899442,106.06784917893603,15.504524705932175,-46.683293790465093,32.050201277831619,59.384555388470936,"-37254.9013762495i","-1034858.37156249i","10227.6093412699-35509.1564850765i",4750,"-1.85956533477634+6.4562102700139i","1+1.05325808339362i","1+0.000456315796633345i","4.10544335586374-4.32014168266539i","0.999992879319568-0.00390281258465501i","4.08855341898697-4.3361336963119i",15.504524705932175,-46.683293790465093,2.8480358684357996]
[30.858241012786692,3125.7158496882398,15.797359180065314,107.26573788319135,15.060881832721378,-49.353977186345197,30.858241012786692,57.911760696846152,"-33945.2786167941i","-942924.406022064i","10062.3688331093-32374.7207496771i",4750,"-1.82952160601987+5.88631286357764i","1+1.15594944627008i","1+0.000500806023480077i","3.70713442221983-4.28092517219025i","0.999991423097267-0.00428333286129443i","3.68876599902169-4.29676734580337i",15.060881832721378,-49.353977186345197,3.1257158496882398]
[29.640475631300156,3430.4692863149198,15.059997602625737,108.58387386091479,14.58047802867442,-51.991348315654918,29.640475631300156,56.592525545259875,"-30929.6736215864i","-859157.600599619i","9925.09041164668-29519.2905671104i",4750,"-1.80456189302667+5.36714373947461i","1+1.26865309025379i","1+0.000549633992520871i","3.31932065198907-4.2063089536007i","0.999989669064259-0.00470095367446085i","3.29951269676936-4.22186947110888i",14.58047802867442,-51.991348315654918,3.4304692863149198]
[28.400018489835045,3764.93580679247,14.335440008260964,110.02536955945308,14.064578481574081,-54.574657239008772,28.400018489835045,55.45071232044431,"-28181.9666627972i","-782832.407299922i","9811.02415866269-26918.4759326584i",4750,"-1.7838225743023+4.89426835139243i","1+1.39234520039249i","1+0.000603222628264676i","2.94795589293686-4.09935094399792i","0.999987556313556-0.00515929237056603i","2.92676945944844-4.11450929930734i",14.064578481574081,-54.574657239008772,3.7649358067924701]
[27.140704728694239,4132.0124001153399,13.625746150894607,111.59230230007543,13.514958577799634,-57.085413527912351,27.140704728694239,54.50688877216308,"-25678.3584172292i","-713287.733811922i","9716.22097639068-24550.0088255416i",4750,"-1.76658563207103+4.46363796828028i","1+1.52809713857094i","1+0.000662036089837958i","2.59796520946349-3.96421283841837i","0.999985011480827-0.00566231901176221i","2.57547963209049-3.97886392853568i",13.514958577799634,-57.085413527912351,4.1320124001153395]
[25.866976356471689,4534.8785081285796,12.933179287441519,113.28532628405945,12.933797069030168,-59.507955964713553,25.866976356471689,53.777370319345899,"-23397.1638279639i","-649921.217443442i","9637.39706478463-22393.5705515105i",4750,"-1.75225401177902+4.07155828209281i","1+1.67708472313507i","1+0.000726583791309008i","2.27303805047772-3.80578832184915i","0.99998194619609-0.00621439077459851i","2.2493463576571-3.81984515958426i",12.933797069030168,-59.507955964713553,4.5348785081285792]
[24.583740242695576,4977.0235643321103,12.260183770328952,115.10325198489578,12.323556472366622,-61.829784603353318,24.583740242695576,53.27346738154246,"-21318.6242787732i","-592184.007743699i","9571.82100479356-20430.6310507434i",4750,"-1.74033109178064+3.71466019104425i","1+1.84059841326801i","1+0.000797424813988901i","1.97556105284954-3.62931229513918i","0.999978254013933-0.00682028970549599i","1.95076513104184-3.64270727087591i",12.323556472366622,-61.829784603353318,4.9770235643321099]
[23.296208191266942,5462.27721768434,11.60934498116532,117.04261621605509,11.68686321010162,-64.041659883670306,23.296208191266942,53.000956332384789,"-19424.7364544376i","-539576.012623265i","9517.21968048618-18644.2999664815i",4750,"-1.73040357827021+3.38987272117845i","1+2.02005448633012i","1+0.000875172748926349i","1.70667548685021-3.44000226959768i","0.999973806715454-0.00748526416128773i","1.68088145771019-3.45268708149606i",11.68686321010162,-64.041659883670306,5.4622772176843402]
[22.009726822826352,5994.8425031894103,10.983329070108237,119.0972773761512,11.026397752718115,-66.137500568596138,22.009726822826352,52.959776807555059,"-17699.0964046424i","-491641.566795621i","9471.6998795956-17019.1890836718i",4750,"-1.72212725083556+3.09439801521305i","1+2.21700730497601i","1+0.000960501011539833i","1.46642792892635-3.24276765325689i","0.999968449853249-0.0082150742953824i","1.43974208571582-3.2547121578465i",11.026397752718115,-66.137500568596138,5.9948425031894104]
[20.729603318212401,6579.3322465756801,10.384801600686222,121.25808092020564,10.344801717526179,-68.114128587647016,20.729603318212401,53.143952332558626,"-16126.7574608077i","-447965.485022435i","9433.68292376563-15541.2856261759i",4750,"-1.71521507704829+2.82568829566834i","1+2.43316278030026i","1+0.0010541486744198i","1.25397630731506-3.04200411791123i","0.99996199738431-0.00901604198566894i","1.2265018160877-3.0531944168336i",10.344801717526179,-68.114128587647016,6.5793322465756798]
[19.46093212145523,7220.8090183854702,9.8163267349851928,123.5126471638205,9.6446053864700385,-69.970914161463796,19.46093212145523,53.541733002356708,"-14694.1007751955i","-408169.465977654i","9401.85010973973-14197.8358282067i",4750,"-1.70942729267995+2.58142469603758i","1+2.67039314762319i","1+0.00115692686882187i","1.06781567084845-2.84147367605478i","0.999954225203836-0.00989510563943722i","1.03965010960753-2.85190975704295i",9.6446053864700385,-69.970914161463796,7.2208090183854701]
[18.208427964486148,7924.8289835391797,9.2802518579818081,125.8453336974577,8.9281761065043383,-71.7093710959536,18.208427964486148,54.135962601504104,"-13388.7173609659i","-371908.815582387i","9375.0971027418-12977.2381572892i",4750,"-1.70456310958942+2.35949784677985i","1+2.93075318289757i","1+0.00126972581029775i","0.905995698377074-2.64425945227424i","0.999944863354565-0.0108598803537337i","0.877229403537559-2.65395266156375i",8.9281761065043383,-71.7093710959536,7.9248289835391796]
[16.976271920191326,8697.4900261778293,8.7785860486185925,128.23741492018544,8.1976858715727339,-73.332743214327863,16.976271920191326,54.904671705857581,"-12199.300611469i","-338869.461429695i","9352.49572373218-11868.9455521035i",4750,"-1.7004537679513+2.15799010038245i","1+3.21649800019492i","1+0.00139352250931645i","0.766311672126709-2.45277809342085i","0.999933586639747-0.0119187239571457i","0.737026793769945-2.46174865347093i",8.1976858715727339,-73.332743214327863,8.6974900261778298]
[15.767978894094675,9545.4845666183501,8.3128837774719084,130.66750014226432,7.4550951166227666,-74.845611778519512,15.767978894094675,55.821888363744804,"-11115.5483678275i","-308765.232439652i","9333.26182206477-10863.3760414867i",4750,"-1.69695669492086+1.97515928027031i","1+3.53010258442482i","1+0.00152938923366159i","0.646459775554671-2.26883143972064i","0.999920003311933-0.0130808095115149i","0.616729909036936-2.27710615790057i",7.4550951166227666,-74.845611778519512,9.5454845666183505]
[14.586295979111561,10476.157527896699,7.8841467270656533,133.11218101093516,6.7021492520459081,-76.253542874380955,14.586295979111561,56.858638136554205,"-10128.0736865647i","-281335.380182351i","9316.72813203115-9951.83112486001i",4750,"-1.69395056946021+1.80942384088363i","1+3.8742832284701i","1+0.00167850279590197i","0.544154708770292-2.09368089977501i","0.999903641442014-0.0143562049100915i","0.514044962793719-2.10129115220452i",6.7021492520459081,-76.253542874380955,10.476157527896699]
[13.433140450033383,11497.5699539774,7.4927559318617405,135.54686389901059,5.9403845181716424,-77.562784537745614,13.433140450033383,57.984079361264975,"-9228.32353439107i","-256342.320399751i","9302.32118244508-9126.42131503927i",4750,"-1.69133112408092+1.65934933000714i","1+4.25202106041638i","1+0.00184215474637906i","0.457212327439911-1.92813136637994i","0.999883932491186-0.0157559602728109i","0.426779698734623-1.93511139224296i",5.9403845181716424,-77.562784537745614,11.497569953977399]
[12.309583387085119,12618.568830660201,7.1384432614105258,137.94671126620122,5.1711401256745946,-78.780016458080567,12.309583387085119,59.166694808120653,"-8408.50470592118i","-233569.575164478i","9289.54146837791-8379.99826837071i",4750,"-1.68900753970507+1.52363604879467i","1+4.66658786465743i","1+0.00202176255999818i","0.383602545871627-1.77261528092377i","0.999860191509511-0.0172922039104599i","0.35289649008621-1.77900078770091i",5.1711401256745946,-78.780016458080567,12.6185688306602]
[11.215880267217631,13848.863713938699,6.8203060777149416,140.28759611303155,4.3955741895026899,-79.912150396979186,11.215880267217631,60.375445716052369,"-7661.51632265725i","-212819.89785159i","9277.94620815008-7706.09295171289i",4750,"-1.68689931057274+1.40110780940234i","1+5.1215744205264i","1+0.00221888191371808i","0.321478639058792-1.62727087047217i","0.999831593265016-0.0189782477083692i","0.290541750222387-1.63309792834295i",4.3955741895026899,-79.912150396979186,13.8488637139387]
[10.151544336732478,15199.1108295293,6.5368628013790842,142.54697111199707,3.6146815353533945,-80.966176661229454,10.151544336732478,61.580794450767613,"-6980.88832857618i","-193913.564682672i","9267.134100767-7098.85931872589i",4750,"-1.68493347286672+1.2907016943138i","1+5.62092160390854i","1+0.00243522016108046i","0.269188910738957-1.49201130789055i","0.999797143462076-0.0208287028679402i","0.238057643800818-1.49731549947921i",3.6146815353533945,-80.966176661229454,15.1991108295293]
[9.1154535308308979,16681.0053720006,6.286141547500586,144.70456956299805,2.8293119833303111,-81.949050618671038,9.1154535308308979,62.755518944327008,"-6360.7254495999i","-176686.818044442i","9256.73157264781-6553.0229872667i",4750,"-1.68304210411778+1.19145872495758i","1+6.16895452122289i","1+0.00267265112048962i","0.225275950686983-1.36658351505866i","0.999755644031763-0.022859607041964i","0.193981341019666-1.37139930192937i",2.8293119833303111,-81.949050618671038,16.681005372000598]
[8.1059783430317118,18307.3828029537,6.0657901863030519,146.74288454621234,2.0401881567286595,-82.867612893895114,8.1059783430317118,63.875271652317224,"-5795.65613155139i","-160990.448098649i","9246.38006085529-6063.83442357673i",4750,"-1.6811600110646+1.10251534974122i","1+6.77041997142493i","1+0.00293323130533099i","0.188467732419406-1.25061662464867i","0.999705651262884-0.0250885640087072i","0.15703608194253-1.25497689199297i",2.0401881567286595,-82.867612893895114,18.3073828029537]
[7.1211170147758338,20092.330025650499,5.8731948000860985,148.64740771482749,1.2479222146897349,-83.728537157303933,7.1211170147758338,64.918870557523562,"-5280.78601432198i","-146688.500397833i","9235.72392596228-5627.02614552385i",4750,"-1.67922253199314+1.02309566282252i","1+7.43052756050839i","1+0.00321921773650635i","0.157663819733584-1.14366087947352i","0.999645425282141-0.0275348971517272i","0.126117331436428-1.14759662330077i",1.2479222146897349,-83.728537157303933,20.092330025650497]
[6.1586256424962231,22051.307399030498,5.7055944716891105,150.40664180483003,0.45303117080711253,-84.538300044106663,6.1586256424962231,65.868341760723368,"-4811.65553926576i","-133657.098312938i","9224.3986240686-5238.77345445147i",4750,"-1.67716338619429+0.95250426444572i","1+8.1549948246201i","1+0.00353308749166907i","0.131919073226997-1.04521812884251i","0.999572869074384-0.030219818149232i","0.100276424731242-1.048758254259i",0.45303117080711253,-84.538300044106663,22.051307399030499]
[5.216133644460788,24201.282647943801,5.5601829963137606,152.01192503958561,-0.34404935185297292,-85.303168514805748,5.216133644460788,66.708756524779858,"-4384.20132263575i","-121783.370073215i","9212.01879738156-4895.65819100835i",4750,"-1.67491250861483+0.890119671092426i","1+8.95009675262279i","1+0.00387755916048575i","0.110426523577689-0.954765207253758i","0.999485454846147-0.0331666124307033i","0.0787033765538198-0.957936411152869i",-0.34404935185297292,-85.303168514805748,24.201282647943803]
[4.2912385983798336,26560.877829466801,5.4341915490356865,153.45711855282701,-1.1429529506558527,-86.029200771405527,4.2912385983798336,67.427917781421485,"-3994.72096049797i","-110964.471124944i","9198.16596980766-4594.63498230501i",4750,"-1.6723938126923+0.83538817860091i","1+9.82272013704691i","1+0.00425561639175939i","0.0925005130282277-0.871771451495613i","0.999380135060348-0.0364008431319595i","0.0607099593504892-0.874598167601808i",-1.1429529506558527,-86.029200771405527,26.560877829466801]
[3.3815779261459871,29150.530628251799,5.3249497234499419,154.73821039573988,-1.9433717973039548,-86.722257602141752,3.3815779261459871,68.015952793598132,"-3639.84096027964i","-101106.693341101i","9182.37556266846-4332.99940327549i",4750,"-1.66952282957608+0.787818073322815i","1+10.7804232241928i","1+0.00467053373636797i","0.0775607847990781-0.795711498643878i","0.999253234886045-0.0399505754756754i","0.0457137328273442-0.798215887042986i",-1.9433717973039548,-86.722257602141752,29.150530628251801]
[2.4848777051925661,31992.671377973798,5.2299251114161898,155.85288437177434,-2.7450474062236236,-87.388021706331671,2.4848777051925661,68.464862665442666,"-3316.48752119045i","-92124.6533664016i","9164.12298180347-4108.3574116168i",4750,"-1.66620417850972+0.746974074839417i","1+11.8315011800442i","1+0.0051259050098575i","0.0651178979130912-0.726074356575571i","0.999100322086794-0.0438466237256564i","0.0332234036689673-0.728276323481216i",-2.7450474062236236,-87.388021706331671,31.992671377973799]
[1.5989807865505243,35111.917342151297,5.146743469593047,156.80009228523298,-3.5477626830425226,-88.032023137742456,1.5989807865505243,68.768069147490522,"-3021.85991043051i","-83940.5530675142i","9142.80857877598-3918.59533084071i",4750,"-1.66232883250472+0.712471878334673i","1+12.9850579390282i","1+0.00562567442035328i","0.0547601366271316-0.662369579581048i","0.99891604947915-0.0481228231130183i","0.0228256852348897-0.664286816098818i",-3.5477626830425226,-88.032023137742456,35.111917342151294]
[0.72185741689933991,38535.2859371054,5.0731925269216376,157.57965724939771,-4.3513351100222977,-88.659669501489972,0.72185741689933991,68.91998774790774,{"$f":"IMDIV(1,COMPLEX(0,2*PI()*$B98*Cz_adj*10^-9))","v":"-2753.40620458276i"},{"$f":"IMDIV(1,COMPLEX(0,2*PI()*$B98*Cp_Cstray_adj*10^-12))","v":"-76483.5056828544i"},{"$f":"IMDIV(IMPRODUCT(IMDIV(IMPRODUCT(J98,IMSUM(Rz_adj*10^3,I98)),IMSUM(J98,IMSUM(Rz_adj*10^3,I98))),Ro_adj*10^3),IMSUM(IMDIV(IMPRODUCT(J98,IMSUM(Rz_adj*10^3,I98)),IMSUM(J98,IMSUM(Rz_adj*10^3,I98))),Ro_adj*10^3))","v":"9117.74136606929-3761.84954844295i"},{"$f":"IF($E$1=\"Feedforward RC\",IMDIV(IMPRODUCT(IMSUM(Rz_2_adj*10^3,IMDIV(1,COMPLEX(0,2*PI()*$B98*Cz_2_adj*10^-12))),RFB1_adj*10^3),IMSUM(IMSUM(Rz_2_adj*10^3,IMDIV(1,COMPLEX(0,2*PI()*$B98*Cz_2_adj*10^-12))),RFB1_adj*10^3)),RFB1_adj*10^3)","v":4750},{"$f":"IMPRODUCT(-gm_EA2*10^-6,K98,IMDIV(RFB2_adj*10^3,IMSUM(L98,RFB2_adj*10^3)))","v":"-1.65777115746714+0.683972645171444i"},{"$f":"COMPLEX(1,2*PI()*B98*1/(1/(Vout_sync_buck/Iout_sync_buck*Number_Cout2*Co_2*10^-6)+(mc_adj*(1-Vout_sync_buck/Vreg)-0.5)/(fsw*10^3*L_buck2*10^-6*Number_Cout2*Co_2*10^-6)))","v":"1+14.2510850579393i"},{"$f":"COMPLEX(1,2*PI()*B98*(ESR_2*10^-3*Co_2*10^-6))","v":"1+0.00617417073140361i"},{"$f":"IMPRODUCT(K_adj,IMDIV(O98,N98))","v":"0.0461419461913382-0.604131230944347i"},{"$f":"IMDIV(1,IMSUM(COMPLEX(1,2*PI()*B98/(wn_adj*Qp_adj)),IMPRODUCT(COMPLEX(0,2*PI()*B98/wn_adj),COMPLEX(0,2*PI()*B98/wn_adj))))","v":"0.998693963983309-0.0528163294136341i"},"0.0141736890451112-0.605779262027754i",-4.3513351100222977,-88.659669501489972,38.5352859371054]
[{"$f":"ABS(G99)","v":0.14839813035614213},42292.428743894998,{"$f":"20*LOG(IMABS(M99))","v":5.0072127967566962},{"$f":"IF(180/PI()*IMARGUMENT(M99)>0,180/PI()*IMARGUMENT(M99),360+180/PI()*IMARGUMENT(M99))","v":158.19192562242205},{"$f":"S99","v":-5.1556109271128383},-89.276279955533937,{"$f":"C99+E99","v":-0.14839813035614213},68.915645666888111,"-2508.80118607312i","-69688.9218353644i","9088.12148280389-3636.47496661864i",4750,"-1.65238572414616+0.661177266657933i","1+15.6405482580249i","1+0.00677614475565881i","0.0389738406898791-0.550920180143035i","0.99842627490064-0.0579679491705635i",{"$f":"IMPRODUCT(P99,Q99)","v":"0.00697679357899784-0.552312416843893i"},{"$f":"20*LOG(IMABS(R99))","v":-5.1556109271128383},{"$f":"180/PI()*IMARGUMENT(R99)","v":-89.276279955533937},{"$f":"B99/1000","v":42.292428743894995}]
[1.0135815817742939,46415.888336127799,4.9468785939267077,158.63747708782111,-5.9604601757010016,-89.887122416711179,-1.0135815817742939,68.750354671109932,"-2285.9262032482i","-63497.9500902277i","9053.02158137947-3541.01109566221i",4750,"-1.64600392388717+0.64382019921131i","1+17.1654824048169i","1+0.00743681050413779i","0.0330136790349588-0.502325167574794i","0.998103572308655-0.0636225039020362i","0.000991886045725407-0.503472957140168i",-5.9604601757010016,-89.887122416711179,46.4158883361278]
[1.8754004482538882,50941.380148163902,4.8903720362849716,158.91689674307585,-6.7657724845388598,-90.497453667771794,-1.8754004482538882,68.419443075304059,"-2082.85081962824i","-57856.9672118957i","9011.36755858698-3474.14452574693i",4750,"-1.63843046519763+0.631662641044895i","1+18.8390957483793i","1+0.00816189034749703i","0.0280591802565825-0.457962974418368i","0.997714484257805-0.0698292320096551i","-0.00398415223409897-0.45887564383913i",-6.7657724845388598,-90.497453667771794,50.941380148163901]
[2.7355011880937816,55908.101825122198,4.835952304075219,159.03060966148021,-7.5714534921690007,-91.112562321098196,-2.7355011880937816,67.918047340382017,"-1897.81609338988i","-52717.1137052745i","8961.91941303363-3434.66637161778i",4750,"-1.62943989327884+0.624484794839595i","1+20.6758843268518i","1+0.00895766458046765i","0.0239415405974448-0.417477957773701i","0.997245258645557-0.0766422324889007i","-0.00812085485321152-0.418162847099465i",-7.5714534921690007,-91.112562321098196,55.908101825122195]
[3.5954998578963906,61359.072734131798,4.7819219587671462,158.97877683833372,-8.3774218166635368,-91.737814831489331,-3.5954998578963906,67.240962006844384,"-1729.21934225345i","-48033.8706181513i","8903.25350186473-3421.42319199991i",4750,"-1.6187733639754+0.622076943999982i","1+22.6917575241971i","1+0.00983102581876414i","0.0205200165532846-0.380541149303905i","0.996679252042675-0.0841209549155409i","-0.0115596101138709-0.381003631447021i",-8.3774218166635368,-91.737814831489331,61.3590727341318]
[4.457014740646386,67341.506577508306,4.7265917609612043,158.76125121633018,-9.1836065016075903,-92.378704979137211,-4.457014740646386,66.382546237192969,"-1575.60026181586i","-43766.6739393297i","8833.74811852845-3433.25989701121i",4750,"-1.60613602155062+0.624229072183855i","1+24.9041758696741i","1+0.010789538699624i","0.0176773457020041-0.346849066760458i","0.995996303099023-0.0923307404815107i","-0.0144182602015145-0.347092550645176i",-9.1836065016075903,-92.378704979137211,67.341506577508312]
[5.3216996713896503,73907.220335257705,4.668245216191151,158.37759309579914,-9.9899448875808012,-93.040907479301467,-5.3216996713896503,65.336685616497675,"-1435.62827709243i","-39878.5632525676i","8751.57513247701-3468.95335515841i",4750,"-1.59119547863218+0.630718791846983i","1+27.3323022725892i","1+0.0118415054030769i","0.0153158881027332-0.316122349674847i","0.995171962115407-0.101343418981791i","-0.0167949773178692-0.316148263459524i",-9.9899448875808012,-93.040907479301467,73.907220335257705]
[6.1912768451240057,81113.083078968702,4.6051040371007259,157.82714518842664,-10.796380882224732,-93.730336632255941,-6.1912768451240057,64.0968085561707,"-1308.09101771287i","-36335.8616031354i","8654.70140677718-3527.13591045866i",4750,"-1.57358207395948+0.64129743826521i","1+29.9971680022497i","1+0.0129960375614562i","0.0133543833551952-0.288104301063802i","0.994176540463513-0.111237966434181i","-0.0187715219271869-0.287912051771683i",-10.796380882224732,-93.730336632255941,81.1130830789687]
[7.0675677876751992,89021.5085445039,4.5352958437958621,157.10916840062785,-11.602863631471061,-94.453211221832049,-7.0675677876751992,62.655957178795802,"-1191.88381694917i","-33107.8838041437i","8540.90477577696-3606.20896389442i",4750,"-1.55289177741399+0.655674357071712i","1+32.9218548507569i","1+0.0142631351799996i","0.0117252309107553-0.262559394445156i","0.992973933128953-0.122101227146646i","-0.020415975606336-0.262146299664944i",-11.602863631471061,-94.453211221832049,89.021508544503902]
[7.9525209129997965,97700.995729922506,4.456825719907977,156.22303966053718,-12.409346632907774,-95.216127220614752,-7.9525209129997965,61.006912439922431,"-1086.00014362086i","-30166.670656135i","8407.81037605653-3704.24832285052i",4750,"-1.52869279564664+0.67349969506373i","1+36.1316950564472i","1+0.0156537732521101i","0.0103722132105895-0.239271788323796i","0.991520153877311-0.134028702027363i","-0.0217850287821924-0.238632974651076i",-12.409346632907774,-95.216127220614752,97.700995729922511]
[8.848233714461843,107226.722201033,4.3675536699233586,155.16851223093485,-13.215787384385202,-96.026140283265789,-8.848233714461843,59.142371947669062,"-989.52288400339i","-27486.7467778721i","8252.95381718579-3818.90532125712i",4750,"-1.50053705767014+0.694346422046748i","1+39.6544907196226i","1+0.0171799968194992i","0.00924859230135416-0.218043877385036i","0.989761504234076-0.147125400920592i","-0.0229258922503178-0.217172138919932i",-13.215787384385202,-96.026140283265789,107.226722201033]
[9.7569672083234558,117681.1952435,4.265180525516973,153.94603646374495,-14.022147733840429,-96.89086052619696,-9.7569672083234558,57.055175937547986,"-901.616398227882i","-25044.8999507746i","8073.87764723149-3947.31082281675i",4750,"-1.46797775404209+0.717692876875771i","1+43.5207546110415i","1+0.0188550253005749i","0.00831552056010719-0.19869489996809i","0.987632273074815-0.161506749361685i","-0.0238778909360124-0.197580508398771i",-14.022147733840429,-96.89086052619696,117.6811952435]
[10.681149873138466,129154.966501488,4.1472453270034713,152.55713437883597,-14.828395200141937,-97.818562720818747,-10.681149873138466,54.738571658017221,"-821.519282368244i","-22819.9800657845i","7868.26626168856-4085.99301439695i",4750,"-1.43059386576155+0.742907820799444i","1+47.763974458944i","1+0.0206933669907212i","0.00754071499554158-0.181059614228184i","0.985051831112821-0.177299527107138i","-0.0246737888665997-0.179690069738813i",-14.828395200141937,-97.818562720818747,129.15496650148799]
[11.623368171457994,141747.41629268101,4.0111375128594702,151.00481449741767,-15.634505684317464,-98.81831578328547,-11.623368171457994,52.186498714132199,"-748.537773524664i","-20792.7159312406i","7634.1211974597-4230.82393027982i",4750,"-1.38802203590176+0.76924071459633i","1+52.4209030037333i","1+0.0227109447262115i","0.00689735230958546-0.164987050139355i","0.981920941376325-0.194642793414739i","-0.0253408856435493-0.163346759508442i",-15.634505684317464,-98.81831578328547,141.74741629268101]
[12.586341019350918,155567.614393047,3.8541271878244392,149.29400412783863,-16.440468207175357,-99.900136328291737,-12.586341019350918,49.393867799546896,"-682.039740781286i","-18945.5483550357i","7369.97311520086-4377.01302488208i",4750,"-1.3399951118547+0.795820549978558i","1+57.5318763326283i","1+0.024925233800198i","0.00636314857543193-0.150339340680534i","0.978117049794272-0.213688716341303i","-0.025901916613617-0.148409205425433i",-16.440468207175357,-99.900136328291737,155.56761439304699]
[13.572876542844128,170735.26474706901,3.6734160809095036,147.43196555439485,-17.246292623753632,-101.07517204334539,-13.572876542844128,46.35679351104946,"-621.449209990571i","-17262.4780552936i","7075.11857146417-4519.16744144351i",4750,"-1.28638519481166+0.821666807535182i","1+63.1411632515587i","1+0.0273554133253431i","0.00591959311129221-0.136990632829558i","0.973488245901762-0.234603160664424i","-0.0263757811288699-0.134747526111975i",-17.246292623753632,-101.07517204334539,170.73526474706901]
[14.585811377888451,187381.74228603899,3.4662103430559488,145.42865199797546,-18.052021720944399,-102.35592165418849,-14.585811377888451,43.072730343786972,"-566.241374960799i","-15728.9270822444i","6749.85958338755-4651.43617843125i",4750,"-1.22724719697955+0.84571566880568i","1+69.2973487203815i","1+0.0300225323541165i","0.00555131100821836-0.12482607709037i","0.967845489593659-0.257565786050959i","-0.026778115344803-0.12224218347903i",-18.052021720944399,-102.35592165418849,187.38174228603899]
[15.627935790910371,205651.23083486501,3.2298139725824306,143.29695146912806,-18.857749763492802,-103.75649910965558,-15.627935790910371,39.540452359472482,"-515.938051835909i","-14331.6125509975i","6395.7138212197-4767.74754234141i",4750,"-1.16285705840358+0.866863189516618i","1+76.0537546725602i","1+0.032949692195618i","0.00524553290930541-0.113740892989055i","0.960952585378935-0.282769239507157i","-0.0271217174004927-0.110782880532715i",-18.857749763492802,-103.75649910965558,205.651230834865]
[16.701911987112801,225701.97196339199,2.9617385126201672,141.05276507515197,-19.66365049973297,-105.29294994351314,-16.701911987112801,35.759815131638831,"-470.103537295661i","-13058.4315915462i","6015.55607983412-4862.13545344825i",4750,"-1.09373746906075+0.88402462789968i","1+83.4689018642466i","1+0.036162246508067i","0.00499165413490952-0.103639507136098i","0.952513256905728-0.310416756175331i","-0.027416822879408-0.100267497570817i",-19.66365049973297,-105.29294994351314,225.701971963392]
[17.810197823876038,247707.63559917099,2.6598211595566044,138.71487419361006,-20.470018983432642,-106.98362686035355,-17.810197823876038,31.731247333256505,"-428.340834701956i","-11898.3565194988i","5613.65121072385-4929.13159302633i",4750,"-1.02066385649524+0.896205744186604i","1+91.6070167530717i","1+0.0396880209000591i","0.00478086819429374-0.0944347599448756i","0.942154553093124-0.34071705279477i","-0.0276712163528077-0.0906010623732807i",-20.470018983432642,-106.98362686035355,247.707635599171]
[18.954993162158065,271858.82427329401,2.3223402871899026,136.30456997798635,-21.277333449347967,-108.84962813761631,-18.954993162158065,27.45494184037004,"-390.288215503843i","-10841.3393195512i","5195.54805014943-4964.18077952045i",4750,"-0.944645100027168+0.902578323549171i","1+100.538587796998i","1+0.0435575539426775i","0.00460586219893058-0.0860471768293146i","0.929405756897494-0.373874724751041i","-0.0278901497095015-0.0816947569718081i",-21.277333449347967,-108.84962813761631,271.85882427329403]
[20.138230503248167,298364.72402833402,1.9481155402407424,133.84504791060397,-22.086346043488909,-110.91529412250136,-20.138230503248167,22.929753788102602,"-355.616086117878i","-9878.22461438551i","4767.82377448606-4964.0221417841i",4750,"-0.866877049906555+0.90254948032438i","1+110.34097599162i","1+0.0478043616799858i","0.00446056376748662-0.078404299608754i","0.913672087429142-0.410073326206827i","-0.0280760193209281-0.073464978307841i",-22.086346043488909,-110.91529412250136,298.36472402833402]
[21.361634653518532,327454.916287773,1.5365798989480461,131.36060500688632,-22.898214552466577,-113.20873996318954,-21.361634653518532,18.151865043696773,"-324.024133146168i","-9000.67036517136i","4337.69547337148-4926.97474032361i",4750,"-0.788671904249359+0.895813589149746i","1+121.099084934102i","1+0.0524652279289679i","0.00433993074896525-0.0714400738741799i","0.89420302847044-0.449446787785509i","-0.0282277325028329-0.0658324983467776i",-22.898214552466577,-113.20873996318954,327.45491628777302]
[22.626877465074912,359381.36638046301,1.0878138397021098,128.87571027049106,-23.714691304777023,-115.76237021888365,-22.626877465074912,13.113340051607409,"-295.238722205396i","-8201.07561681652i","3912.54372632084-4853.07701618154i",4750,"-0.711371586603788+0.882377639305733i","1+132.906096217516i","1+0.0575805228833541i","0.00423977654172435-0.065094288179498i","0.870056546302758-0.492032700700537i","-0.0283396730781493-0.0587218202596819i",-23.714691304777023,-115.76237021888365,359.38136638046302]
[23.935852919593785,394420.60594376602,0.60253659927609116,126.41404169011793,-24.538389518869877,-118.61326302612267,-23.935852919593785,7.8007786639952599,"-269.010527836683i","-7472.51466213008i","3499.41307862878-4744.05384853314i",4750,"-0.63625692338705+0.862555245187842i","1+145.864276525225i","1+0.0631945527809259i","0.00415662499755938-0.0593120610860679i","0.840063608090018-0.53769834308808i","-0.0284001675781908-0.0520609144132439i",-24.538389518869877,-118.61326302612267,394.42060594376602]
[25.291094179514193,432876.12810830597,8.2055582781937406E-2,123.99758913360806,-25.37314976229613,-121.80321392720391,-25.291094179514193,2.1943752064041462,"-245.112373967755i","-6808.67705465988i","3104.5597761125-4603.11693490708i",4750,"-0.564465413838635+0.836930351801286i","1+160.085863415973i","1+0.0693559436629519i","0.00408758991040648-0.054043372287944i","0.802803625588637-0.586027771874437i","-0.0283893850464907-0.0457816564193299i",-25.37314976229613,-121.80321392720391,432.87612810830598]
[26.696344981804053,475081.01621027902,-0.47181926650700945,121.64591018469122,-26.224525715297045,-125.37807647733315,-26.696344981804053,-3.732166292641935,"-223.33726622247i","-6203.81295062418i","2733.10602310906-4434.63446830469i",4750,"-0.49692836783801+0.806297176055397i","1+175.69403747192i","1+0.0761180625496955i","0.00403027493119638-0.0492426342640588i","0.756612554573237-0.636157832709287i","-0.0282767308789948-0.0398214862698976i",-26.224525715297045,-125.37807647733315,475.08101621027902]
[28.157275928180745,521400.82879996998,-1.056885109956748,119.37559882561948,-27.100390818223996,-129.3858211793613,-28.157275928180745,-10.010222353741824,"-203.496599034564i","-5652.68330651568i","2388.83622570323-4243.72616082439i",4750,"-0.434333859218768+0.771586574695342i","1+192.823989229923i","1+0.0835394796800144i","0.00398269045158945-0.0448683011311883i","0.699662889070511-0.686557281317611i","-0.0280181181343359-0.0341270303259057i",-27.100390818223996,-129.3858211793613,521.40082879996999]
[29.682288578787254,572236.76593502203,-1.670666993058868,117.19999229041322,-28.011621585728385,-133.87248595952514,-29.682288578787254,-16.672493669111915,"-185.418522036463i","-5150.51450101285i","2074.14196246883-4035.84510740243i",4750,"-0.377116720448878+0.733790019527713i","1+211.624090137287i","1+0.0916844758187478i","0.0039431845829737-0.0408825116003626i","0.630177043997295-0.734765482242462i","-0.0275541539468894-0.0286605362331813i",-28.011621585728385,-133.87248595952514,572.23676593502205]
[31.283258694339793,628029.14418342605,-2.3105374504722613,115.12910782397655,-28.972721243867532,-138.87503549623682,-31.283258694339793,-23.745927672260265,"-168.946451573604i","-4692.95698815566i","1790.09706696924-3816.39964705444i",4750,"-0.325472193994407+0.693890844918988i","1+232.257177674264i","1+0.100623599025954i","0.00391038584269844-0.0372507631640474i","0.54685099560898-0.777158368653675i","-0.0268113439403806-0.0234096060057716i",-28.972721243867532,-138.87503549623682,628.02914418342607]
[32.975924379481384,689261.21043497103,-2.9738250384966931,113.16977514546598,-30.002099340984692,-144.41038592317091,-32.975924379481384,-31.24061077770493,"-153.937714451737i","-4276.04762365934i","1536.62785771128-3590.45115548915i",4750,"-0.279386883220232+0.652809300998026i","1+254.901965774406i","1+0.110434275710453i","0.00388315556337639-0.0339416148584372i","0.449541476426689-0.808896839443126i","-0.025709625499431-0.0183992359180491i",-30.002099340984692,-144.41038592317091,689.26121043497108]
[34.779458314447929,756463.32755462895,-3.6579052697552883,111.32591543816055,-31.121553044692639,-150.46098648488149,-34.779458314447929,-39.135071046720938,"-140.262312169964i","-3896.17533805455i",{"$f":"IMDIV(IMPRODUCT(IMDIV(IMPRODUCT(J130,IMSUM(Rz_adj*10^3,I130)),IMSUM(J130,IMSUM(Rz_adj*10^3,I130))),Ro_adj*10^3),IMSUM(IMDIV(IMPRODUCT(J130,IMSUM(Rz_adj*10^3,I130)),IMSUM(J130,IMSUM(Rz_adj*10^3,I130))),Ro_adj*10^3))","v":"1312.73787300532-3362.5038800396i"},4750,{"$f":"IMPRODUCT(-gm_EA2*10^-6,K130,IMDIV(RFB2_adj*10^3,IMSUM(L130,RFB2_adj*10^3)))","v":"-0.238679613273694+0.611364341825381i"},"1+279.754592759163i","1+0.121201481260341i",{"$f":"IMPRODUCT(K_adj,IMDIV(O130,N130))","v":"0.00386054837687267-0.0309264161522029i"},"0.34015254495906-0.824308846627762i","-0.0241797430734218-0.0137019833405254i",-31.121553044692639,-150.46098648488149,756.4633275546289]
[36.714705393222772,830217.56813197501,-4.3602708830594992,109.59891357470168,-32.354434510163273,-156.95979826456772,-36.714705393222772,-47.36088468986604,"-127.801794935915i","-3550.04985933098i","1116.7497057016-3136.38571603698i",4750,"-0.203045401036654+0.570251948370359i","1+307.030320194194i","1+0.133018476059154i","0.00384177940371125-0.0281790597086987i","0.223409094542552-0.817954431866866i","-0.0221908983165558-0.00943785870410135i",-32.354434510163273,-156.95979826456772,830.21756813197499]
[38.800850239079146,911162.75611549104,-5.0785812937881616,107.9880345889776,-33.722268945290985,-163.78075733209496,-38.800850239079146,-55.792722743117366,"-116.448235710315i","-3234.67321417541i","946.535169662399-2915.20707218197i",4750,"-0.172097303574981+0.53003764948763i","1+336.965397382066i","1+0.14598761326269i","0.00382619701058835-0.0256757559522243i","0.106925321269236-0.786349446568153i","-0.019780999138654-0.00575411635575895i",-33.722268945290985,-163.78075733209496,911.16275611549099]
[41.051056650385398,1000000,-5.8106931266912598,106.49084473955264,-35.240363523694135,-170.74243579041359,-41.051056650385398,-64.251591050860952,"-106.103295394597i","-2947.31376096102i","799.715462469002-2701.37917382898i",4750,"-0.145402811358+0.491159849787086i","1+369.819107640694i","1+0.160221225333079i","0.00381326019142035-0.0233948275402559i","-0.729740060027543i","-0.0170721428535604-0.00278268872098773i",-35.240363523694135,-170.74243579041359,1000]
[0.72594027067762479,{"$f":"100","v":100},{"$f":"C135","v":4.9664564153128001},null,{"$f":"E135","v":-5.6923966859904249},null,-0.72594027067762479]
[{"$f":"ABS(G135)","v":0.72594027067762479},{"$f":"fc_2*1000","v":45000},{"$f":"20*LOG(IMABS(M135))","v":4.9664564153128001},{"$f":"IF(180/PI()*IMARGUMENT(M135)>0,180/PI()*IMARGUMENT(M135),360+180/PI()*IMARGUMENT(M135))","v":158.50758926376469},{"$f":"S135","v":-5.6923966859904249},{"$f":"T135","v":-89.684034207556962},{"$f":"C135+E135","v":-0.72594027067762479},{"$f":"D135+F135","v":68.823555056207724},{"$f":"IMDIV(1,COMPLEX(0,2*PI()*$B135*Cz_adj*10^-9))","v":"-2357.85100876882i"},{"$f":"IMDIV(1,COMPLEX(0,2*PI()*$B135*Cp_Cstray_adj*10^-12))","v":"-65495.8613546894i"},{"$f":"IMDIV(IMPRODUCT(IMDIV(IMPRODUCT(J135,IMSUM(Rz_adj*10^3,I135)),IMSUM(J135,IMSUM(Rz_adj*10^3,I135))),Ro_adj*10^3),IMSUM(IMDIV(IMPRODUCT(J135,IMSUM(Rz_adj*10^3,I135)),IMSUM(J135,IMSUM(Rz_adj*10^3,I135))),Ro_adj*10^3))","v":"9065.38113616109-3569.56156891388i"},{"$f":"IF($E$1=\"Feedforward RC\",IMDIV(IMPRODUCT(IMSUM(Rz_2_adj*10^3,IMDIV(1,COMPLEX(0,2*PI()*$B135*Cz_2_adj*10^-12))),RFB1_adj*10^3),IMSUM(IMSUM(Rz_2_adj*10^3,IMDIV(1,COMPLEX(0,2*PI()*$B135*Cz_2_adj*10^-12))),RFB1_adj*10^3)),RFB1_adj*10^3)","v":4750},{"$f":"IMPRODUCT(-gm_EA2*10^-6,K135,IMDIV(RFB2_adj*10^3,IMSUM(L135,RFB2_adj*10^3)))","v":"-1.64825111566565+0.649011194347977i"},{"$f":"COMPLEX(1,2*PI()*B135*1/(1/(Vout_sync_buck/Iout_sync_buck*Number_Cout2*Co_2*10^-6)+(mc_adj*(1-Vout_sync_buck/Vreg)-0.5)/(fsw*10^3*L_buck2*10^-6*Number_Cout2*Co_2*10^-6)))","v":"1+16.6418598438312i"},{"$f":"COMPLEX(1,2*PI()*B135*(ESR_2*10^-3*Co_2*10^-6))","v":"1+0.00720995513998858i"},{"$f":"IMPRODUCT(K_adj,IMDIV(O135,N135))","v":"0.0348774360229861-0.518018427592356i"},{"$f":"IMDIV(1,IMSUM(COMPLEX(1,2*PI()*B135/(wn_adj*Qp_adj)),IMPRODUCT(COMPLEX(0,2*PI()*B135/wn_adj),COMPLEX(0,2*PI()*B135/wn_adj))))","v":"0.998217795777504-0.0616807962796335i"},{"$f":"IMPRODUCT(P135,Q135)","v":"0.00286348820781591-0.51924648098946i"},{"$f":"20*LOG(IMABS(R135))","v":-5.6923966859904249},{"$f":"180/PI()*IMARGUMENT(R135)","v":-89.684034207556962}]
[{"$f":"ABS(G136)","v":0.72594027067762479},{"$f":"B133","v":1000000},{"$f":"C135","v":4.9664564153128001},null,{"$f":"E135","v":-5.6923966859904249},null,{"$f":"C136+E136","v":-0.72594027067762479}]
[null,null,"Error Amplifier"]
[{"$f":"ABS(G138)","v":0.72594027067762479},{"$f":"fc_2*1000","v":45000},{"$f":"20*LOG(IMABS(M138))","v":4.9664564153128001},{"$f":"IF(180/PI()*IMARGUMENT(M138)>0,180/PI()*IMARGUMENT(M138),360+180/PI()*IMARGUMENT(M138))","v":158.50758926376469},{"$f":"S138","v":-5.6923966859904249},{"$f":"T138","v":-89.684034207556962},{"$f":"C138+E138","v":-0.72594027067762479},{"$f":"D138+F138","v":68.823555056207724},{"$f":"IMDIV(1,COMPLEX(0,2*PI()*$B138*Cz_adj*10^-9))","v":"-2357.85100876882i"},{"$f":"IMDIV(1,COMPLEX(0,2*PI()*$B138*Cp_Cstray_adj*10^-12))","v":"-65495.8613546894i"},{"$f":"IMDIV(IMPRODUCT(IMDIV(IMPRODUCT(J138,IMSUM(Rz_adj*10^3,I138)),IMSUM(J138,IMSUM(Rz_adj*10^3,I138))),Ro_adj*10^3),IMSUM(IMDIV(IMPRODUCT(J138,IMSUM(Rz_adj*10^3,I138)),IMSUM(J138,IMSUM(Rz_adj*10^3,I138))),Ro_adj*10^3))","v":"9065.38113616109-3569.56156891388i"},{"$f":"IF($E$1=\"Feedforward RC\",IMDIV(IMPRODUCT(IMSUM(Rz_2_adj*10^3,IMDIV(1,COMPLEX(0,2*PI()*$B138*Cz_2_adj*10^-12))),RFB1_adj*10^3),IMSUM(IMSUM(Rz_2_adj*10^3,IMDIV(1,COMPLEX(0,2*PI()*$B138*Cz_2_adj*10^-12))),RFB1_adj*10^3)),RFB1_adj*10^3)","v":4750},{"$f":"IMPRODUCT(-gm_EA2*10^-6,K138,IMDIV(RFB2_adj*10^3,IMSUM(L138,RFB2_adj*10^3)))","v":"-1.64825111566565+0.649011194347977i"},{"$f":"COMPLEX(1,2*PI()*B138*1/(1/(Vout_sync_buck/Iout_sync_buck*Number_Cout2*Co_2*10^-6)+(mc_adj*(1-Vout_sync_buck/Vreg)-0.5)/(fsw*10^3*L_buck2*10^-6*Number_Cout2*Co_2*10^-6)))","v":"1+16.6418598438312i"},{"$f":"COMPLEX(1,2*PI()*B138*(ESR_2*10^-3*Co_2*10^-6))","v":"1+0.00720995513998858i"},{"$f":"IMPRODUCT(K_adj,IMDIV(O138,N138))","v":"0.0348774360229861-0.518018427592356i"},{"$f":"IMDIV(1,IMSUM(COMPLEX(1,2*PI()*B138/(wn_adj*Qp_adj)),IMPRODUCT(COMPLEX(0,2*PI()*B138/wn_adj),COMPLEX(0,2*PI()*B138/wn_adj))))","v":"0.998217795777504-0.0616807962796335i"},{"$f":"IMPRODUCT(P138,Q138)","v":"0.00286348820781591-0.51924648098946i"},{"$f":"20*LOG(IMABS(R138))","v":-5.6923966859904249},{"$f":"180/PI()*IMARGUMENT(R138)","v":-89.684034207556962}]
[]
[null,"Cz = infinity",{"$f":"20*LOG(IMABS((-gm_EA2*10^-6*Rz_adj*10^3)))","v":17.501225267834002}]
[null,null,{"$f":"Rz_adj","v":10}]

{"sheet":"Diode Curve","index":3,"n_rows":70,"n_cols":15,"rows_kept":70,"cut":false,"hidden":false,"merged":[[55,4,55,6],[68,5,68,6],[69,5,69,6],[55,8,55,10],[68,9,68,10],[69,9,69,10]]}
[]
[]
[]
[]
[]
[]
[]
[]
[]
[]
[]
[]
[]
[]
[]
[]
[]
[]
[]
[]
[]
[]
[]
[]
[]
[]
[]
[]
[]
[]
[]
[]
[]
[]
[]
[]
[]
[]
[]
[]
[]
[null,null,null,"If",0.01,0.02,0.05,0.1,0.2,0.5,1,2,5,10,20]
[null,null,null,"Vf 25",0.34,0.35,0.36499999999999999,0.38,0.41,0.45,0.51,0.6,0.8,0.98,1.2]
[null,null,null,"Vf 150",0.08,0.1,0.13300000000000001,0.2,0.24,0.32500000000000001,0.4,0.5,0.64,0.76,0.98]
[null,null,null,"delta",{"$f":"E43-E44","v":0.26},{"$f":"F43-F44","v":0.24999999999999997},0.23199999999999998,0.18,0.16999999999999998,0.125,0.10999999999999999,9.9999999999999978E-2,0.16000000000000003,0.21999999999999997,0.21999999999999997]
[null,null,null,null,0.01,0.3,{"$f":"F46","v":0.3},3,{"$f":"H46","v":3},10]
[null,null,null,null,0.08,0.20499999999999999,{"$f":"F47","v":0.20499999999999999},0.4,{"$f":"H47","v":0.4},0.61]
[null,null,null,null,25,{"$f":"E48","v":25},{"$f":"F48","v":25},25,25,25,25,25,25,25,{"$f":"N48","v":25}]
[null,null,null,null,{"$f":"IF(Reset=1,0.45,FORECAST(E42, OFFSET(Vd_1:Vd_3,MATCH(E42,I_Vd1:I_Vd3,1)-1,0,2), OFFSET(I_Vd1:I_Vd3,MATCH(E42,I_Vd1:I_Vd3,1)-1,0,2))+(E48-25)*vd_temp_coeff/1000)","v":0.34},{"$f":"IF(Reset=1,0.45,FORECAST(F42, OFFSET(Vd_1:Vd_3,MATCH(F42,I_Vd1:I_Vd3,1)-1,0,2), OFFSET(I_Vd1:I_Vd3,MATCH(F42,I_Vd1:I_Vd3,1)-1,0,2))+(F48-25)*vd_temp_coeff/1000)","v":0.35},{"$f":"IF(Reset=1,0.45,FORECAST(G42, OFFSET(Vd_1:Vd_3,MATCH(G42,I_Vd1:I_Vd3,1)-1,0,2), OFFSET(I_Vd1:I_Vd3,MATCH(G42,I_Vd1:I_Vd3,1)-1,0,2))+(G48-25)*vd_temp_coeff/1000)","v":0.36499999999999999},{"$f":"IF(Reset=1,0.45,FORECAST(H42, OFFSET(Vd_1:Vd_3,MATCH(H42,I_Vd1:I_Vd3,1)-1,0,2), OFFSET(I_Vd1:I_Vd3,MATCH(H42,I_Vd1:I_Vd3,1)-1,0,2))+(H48-25)*vd_temp_coeff/1000)","v":0.38},{"$f":"IF(Reset=1,0.45,FORECAST(I42, OFFSET(Vd_1:Vd_3,MATCH(I42,I_Vd1:I_Vd3,1)-1,0,2), OFFSET(I_Vd1:I_Vd3,MATCH(I42,I_Vd1:I_Vd3,1)-1,0,2))+(I48-25)*vd_temp_coeff/1000)","v":0.41},{"$f":"IF(Reset=1,0.45,FORECAST(J42, OFFSET(Vd_1:Vd_3,MATCH(J42,I_Vd1:I_Vd3,1)-1,0,2), OFFSET(I_Vd1:I_Vd3,MATCH(J42,I_Vd1:I_Vd3,1)-1,0,2))+(J48-25)*vd_temp_coeff/1000)","v":0.45},{"$f":"IF(Reset=1,0.45,FORECAST(K42, OFFSET(Vd_1:Vd_3,MATCH(K42,I_Vd1:I_Vd3,1)-1,0,2), OFFSET(I_Vd1:I_Vd3,MATCH(K42,I_Vd1:I_Vd3,1)-1,0,2))+(K48-25)*vd_temp_coeff/1000)","v":0.51},{"$f":"IF(Reset=1,0.45,FORECAST(L42, OFFSET(Vd_1:Vd_3,MATCH(L42,I_Vd1:I_Vd3,1)-1,0,2), OFFSET(I_Vd1:I_Vd3,MATCH(L42,I_Vd1:I_Vd3,1)-1,0,2))+(L48-25)*vd_temp_coeff/1000)","v":0.6},{"$f":"IF(Reset=1,0.45,FORECAST(M42, OFFSET(Vd_1:Vd_3,MATCH(M42,I_Vd1:I_Vd3,1)-1,0,2), OFFSET(I_Vd1:I_Vd3,MATCH(M42,I_Vd1:I_Vd3,1)-1,0,2))+(M48-25)*vd_temp_coeff/1000)","v":0.8},{"$f":"IF(Reset=1,0.45,FORECAST(N42, OFFSET(Vd_1:Vd_3,MATCH(N42,I_Vd1:I_Vd3,1)-1,0,2), OFFSET(I_Vd1:I_Vd3,MATCH(N42,I_Vd1:I_Vd3,1)-1,0,2))+(N48-25)*vd_temp_coeff/1000)","v":0.97999999999999987},{"$f":"IF(Reset=1,0.45,FORECAST(O42, OFFSET(Vd_1:Vd_3,MATCH(O42,I_Vd1:I_Vd3,1)-1,0,2), OFFSET(I_Vd1:I_Vd3,MATCH(O42,I_Vd1:I_Vd3,1)-1,0,2))+(O48-25)*vd_temp_coeff/1000)","v":1.1895238095238094}]
[null,null,null,null,150,{"$f":"E50","v":150},{"$f":"F50","v":150},150,150,150,150,150,150,150,150]
[null,null,null,null,{"$f":"IF(Reset=1,0.45,FORECAST(E42, OFFSET(Vd_1:Vd_3,MATCH(E42,I_Vd1:I_Vd3,1)-1,0,2), OFFSET(I_Vd1:I_Vd3,MATCH(E42,I_Vd1:I_Vd3,1)-1,0,2))+(E50-25)*vd_temp_coeff/1000)","v":0.19000000000000003},{"$f":"IF(Reset=1,0.45,FORECAST(F42, OFFSET(Vd_1:Vd_3,MATCH(F42,I_Vd1:I_Vd3,1)-1,0,2), OFFSET(I_Vd1:I_Vd3,MATCH(F42,I_Vd1:I_Vd3,1)-1,0,2))+(F50-25)*vd_temp_coeff/1000)","v":0.19999999999999998},{"$f":"IF(Reset=1,0.45,FORECAST(G42, OFFSET(Vd_1:Vd_3,MATCH(G42,I_Vd1:I_Vd3,1)-1,0,2), OFFSET(I_Vd1:I_Vd3,MATCH(G42,I_Vd1:I_Vd3,1)-1,0,2))+(G50-25)*vd_temp_coeff/1000)","v":0.215},{"$f":"IF(Reset=1,0.45,FORECAST(H42, OFFSET(Vd_1:Vd_3,MATCH(H42,I_Vd1:I_Vd3,1)-1,0,2), OFFSET(I_Vd1:I_Vd3,MATCH(H42,I_Vd1:I_Vd3,1)-1,0,2))+(H50-25)*vd_temp_coeff/1000)","v":0.23},{"$f":"IF(Reset=1,0.45,FORECAST(I42, OFFSET(Vd_1:Vd_3,MATCH(I42,I_Vd1:I_Vd3,1)-1,0,2), OFFSET(I_Vd1:I_Vd3,MATCH(I42,I_Vd1:I_Vd3,1)-1,0,2))+(I50-25)*vd_temp_coeff/1000)","v":0.26},{"$f":"IF(Reset=1,0.45,FORECAST(J42, OFFSET(Vd_1:Vd_3,MATCH(J42,I_Vd1:I_Vd3,1)-1,0,2), OFFSET(I_Vd1:I_Vd3,MATCH(J42,I_Vd1:I_Vd3,1)-1,0,2))+(J50-25)*vd_temp_coeff/1000)","v":0.30000000000000004},{"$f":"IF(Reset=1,0.45,FORECAST(K42, OFFSET(Vd_1:Vd_3,MATCH(K42,I_Vd1:I_Vd3,1)-1,0,2), OFFSET(I_Vd1:I_Vd3,MATCH(K42,I_Vd1:I_Vd3,1)-1,0,2))+(K50-25)*vd_temp_coeff/1000)","v":0.36},{"$f":"IF(Reset=1,0.45,FORECAST(L42, OFFSET(Vd_1:Vd_3,MATCH(L42,I_Vd1:I_Vd3,1)-1,0,2), OFFSET(I_Vd1:I_Vd3,MATCH(L42,I_Vd1:I_Vd3,1)-1,0,2))+(L50-25)*vd_temp_coeff/1000)","v":0.44999999999999996},{"$f":"IF(Reset=1,0.45,FORECAST(M42, OFFSET(Vd_1:Vd_3,MATCH(M42,I_Vd1:I_Vd3,1)-1,0,2), OFFSET(I_Vd1:I_Vd3,MATCH(M42,I_Vd1:I_Vd3,1)-1,0,2))+(M50-25)*vd_temp_coeff/1000)","v":0.65},{"$f":"IF(Reset=1,0.45,FORECAST(N42, OFFSET(Vd_1:Vd_3,MATCH(N42,I_Vd1:I_Vd3,1)-1,0,2), OFFSET(I_Vd1:I_Vd3,MATCH(N42,I_Vd1:I_Vd3,1)-1,0,2))+(N50-25)*vd_temp_coeff/1000)","v":0.82999999999999985},{"$f":"IF(Reset=1,0.45,FORECAST(O42, OFFSET(Vd_1:Vd_3,MATCH(O42,I_Vd1:I_Vd3,1)-1,0,2), OFFSET(I_Vd1:I_Vd3,MATCH(O42,I_Vd1:I_Vd3,1)-1,0,2))+(O50-25)*vd_temp_coeff/1000)","v":1.0395238095238095}]
[]
[]
[]
[]
[null,null,null,null,"Buck  Diode Specs",null,null,null,"Boost  Diode Specs"]
[null,null,null,null,null,"If","Vf",null,null,"If","Vf"]
[null,null,null,null,null,0.01,0.34,null,null,0.01,0.34]
[null,null,null,null,null,0.02,0.35,null,null,0.02,0.35]
[null,null,null,null,null,0.05,0.36499999999999999,null,null,0.05,0.36499999999999999]
[null,null,null,null,null,0.1,0.38,null,null,0.1,0.38]
[null,null,null,null,null,0.2,0.41,null,null,0.2,0.41]
[null,null,null,null,null,0.5,0.45,null,null,0.5,0.45]
[null,null,null,null,null,1,0.51,null,null,1,0.51]
[null,null,null,null,null,2,0.6,null,null,2,0.6]
[null,null,null,null,null,5,0.8,null,null,5,0.8]
[null,null,null,null,null,10,0.98,null,null,10,0.98]
[null,null,null,null,null,20.5,1.2,null,null,20.5,1.2]
[null,null,null,null,"VF, Temp. Coeff.",-1.2,null,null,"VF, Temp. Coeff.",-1]
[null,null,null,null,"RTHAVG",120,null,null,"RTHAVG",120]