{"text_format":"1","workbook":"xlsx","n_sheets":5,"sheets":["Design","Efficiency","Snubber","Constants","Sheet1"],"not_rendered":{"charts":4,"images":6,"macros":1,"external_links":0,"defined_names":103,"comments":0,"pivot_tables":0},"unopened":[],"bounds":{"document_bytes":16777216,"sheet_cells":100000,"rows_first":2000,"rows_last":500,"rows_between":2000,"halvings":0,"cell_chars":16384,"cell_head_chars":4096},"cells_cut":0,"cells_raw":0,"read":"whole","date_system":"1900"}

{"sheet":"Design","index":0,"n_rows":104,"n_cols":12,"rows_kept":104,"cut":false,"hidden":false,"merged":[[93,3,93,5],[94,3,94,5],[95,3,95,5],[88,3,88,5],[89,3,89,5],[90,3,90,5],[91,3,91,5],[92,3,92,5],[83,0,83,5],[84,3,84,5],[85,3,85,5],[86,3,86,5],[87,3,87,5],[40,0,40,5],[52,0,52,5],[44,3,44,5],[45,3,45,5],[46,3,46,5],[51,3,51,5],[41,3,41,5],[47,3,47,5],[48,3,48,5],[50,3,50,5],[34,3,34,5],[36,3,36,5],[0,0,0,5],[23,3,23,5],[22,0,22,5],[1,0,1,5],[20,1,20,2],[13,0,13,2],[13,4,13,5],[20,4,20,5],[21,1,21,2],[82,3,82,5],[72,3,72,5],[52,11,52,14],[22,8,22,11],[32,13,32,14],[71,3,71,5],[56,3,56,5],[58,3,58,5],[53,3,53,5],[55,3,55,5],[70,3,70,5],[64,3,64,5],[60,3,60,5],[61,3,61,5],[39,3,39,5],[35,4,35,5],[38,3,38,5],[28,0,28,5],[24,0,24,5],[33,0,33,5],[103,0,106,5],[63,3,63,5],[73,3,73,5],[62,0,62,5],[76,3,76,5],[78,3,78,5],[67,0,67,5],[68,0,68,5],[66,3,66,5],[79,3,79,5],[80,3,80,5],[81,3,81,5]]}
["ALLEGRO ALT80802 DESIGN SPREADSHEET for Buck-Boost - Rev. 2.0"]
["INSTRUCTIONS:   Enter design goals and component values in the white boxes.\n***Ensure \"Iterative Calculation\" is enabled under File -> Options -> Formulas***"]
["VARIABLES","MIN","TYP","MAX","UNITS","COMMENTS"]
["Vin",6,13.5,18,"V",{"$f":"IF(B4<VIN_MIN_IC,\"Vin_min is lower than minimum VIN level\",IF((VIN_MAX_app+VOUT)>VIN_MAX_IC,\"Vin_max is higher than maximum VIN level\",\"Steady-state input operating voltages\"))","v":"Steady-state input operating voltages"}]
["LED Current Target","‒",0.35,"‒","A",{"$f":"IF(COUNTIF(Efficiency!AA4:AA48,\"TSD\")>0,\"IC may overheat!\",\"Desired output Current  (recommended 0.1A-1A)\")","v":"Desired output Current  (recommended 0.1A-1A)"}]
["Number of LEDs","‒",4,"‒","‒",{"$f":" IF(VOUT>=Constants!B9, \"Output voltage is higher than the output voltage limit\",\"Recommended 1-4 white LEDs or 1-6 red LEDs\")","v":"Recommended 1-4 white LEDs or 1-6 red LEDs"}]
["LED Forward Voltage","‒",3.05,"‒","V","Typical value @ target LED current "]
["RLED ","‒",0.9,"‒","Ω","LED resistance @ operating current "]
["CS Resistor Tolerance","‒",1,1.6,"%","1% initial tolerance + 100ppm @ 60°C rise"]
["Lo_tolerance",-20,"‒",20,"%","Output inductor tolerances"]
["RTHJA","‒",45,"‒","°C/W","Thermal resistance, 4 layer PCB, default value is 45"]
["Desired fsw","‒",2,"‒","MHz","Desired switching frequency"]
["TAMB","‒","‒",85,"°C","Maximum steady-state ambient temperature"]
["DIODE (D1) CHARACTERIZATION",null,null,"UNITS","COMMENTS"]
["VF_nominal",0.7,0.42,"A   |   VF","VF at nominal output current + input current, nominal VIN@25 °C"]
{"$rows_left_out":90}
{"sheet":"Efficiency","index":1,"n_rows":51,"n_cols":27,"rows_kept":51,"cut":false,"hidden":false,"merged":[[3,1,3,2],[3,3,3,6],[0,0,1,26],[2,0,2,11],[2,16,2,25]]}
["INSTRUCTIONS:  No values need to be entered here, all values are derived from the DESIGN tab"]
[]
["If iteration error occurs, please set 'Reset' to 1 and then 0",null,null,null,null,null,null,null,null,null,null,null,"Reset=",0,null,null,"If not in normal operation, the calculation result is not valid"]
[null,{"$f":"Design!C30","v":0.35026269702276713},null,{"$f":"IF($I$4=\"None\",VOUT,VOUT-V_cs+VLOOKUP($I$4,Design!$A$99:$F$102,6))","v":12.399999999999999},null,null,null,"Binning","NONE",null,"Max Duty",{"$f":"(1-Min_tOFF_typ/Tsw)","v":0.8}]
["T (°C)","VIN","VF","Duty","TON(ns)","TOFF","ΔIL","PIQ","Psw","Pcond","PDRIVER","PIC","PD1","PIND","PSNUB","PSENSE","TJD1","TJIC","RDSon","VOSAT","VOUT","PLOSS_tol","POUT","PIN","IL,AVG","Efficiency","Operating Condition "]
[25,{"$f":"Design!B4","v":6},{"$f":"IF(Reset=1,VF,FORECAST($B$4+Y6, OFFSET(Design!$C$16:$C$20,MATCH($B$4+Y6,Design!$B$16:$B$20,1)-1,0,2), OFFSET(Design!$B$16:$B$20,MATCH($B$4+Y6,Design!$B$16:$B$20,1)-1,0,2))+(Q6-$A$6)*Design!$B$21/1000)","v":0.44568780248413919},{"$f":"IF(Reset=1,$D$4/(B6+$D$4),MIN(($D$4+C6+Y6*LO_DCR/1000*(1+(R6-25)*(Constants!$C$32/100)))/(B6-Y6*S6/1000+C6+$D$4),(Tsw-Min_tOFF_typ)/Tsw))","v":0.69189485060398936},{"$f":"IF(D6>=(Tsw-Min_tOFF_typ)/Tsw,Tsw-Min_tOFF_typ,IF(Tsw*Efficiency!D6>Constants!$C$19,Tsw*Efficiency!D6,Constants!$C$19))","v":345.94742530199466},{"$f":"IF(E6=Constants!$C$19,Tsw-Constants!$C$19,IF(Tsw*(1-Efficiency!D6)>Min_tOFF_typ,Tsw*(1-Efficiency!D6),Min_tOFF_typ))","v":154.05257469800532},{"$f":"IF(Reset=1,(B6)/(L_buckboost*micro)*D6*Tsw*nano,(B6-($B$4+Y6)*(S6/1000+LO_DCR/1000*(1+(R6-A6)*(Constants!$C$32/100))))/(L_buckboost*micro)*D6*Tsw*nano)","v":0.41658078598284826},{"$f":"(B6+$D$4)*Iq*micro","v":9.2E-5},{"$f":"(B6+$D$4)*Y6*((B6+$D$4)/(Slew_rise*10^9)*fsw*10^6/2+(B6+$D$4)/(Slew_fall*10^9)*fsw*10^6/2)","v":0.57732695608866447},{"$f":"D6*(($B$4/(1-D6))^2+G6^2/12)*S6*10^-3","v":0.17209362977443882},{"$f":"Qg*10^-9*(B6+$D$4)*fsw*10^6","v":0.18399999999999997},{"$f":"SUM(H6:K6)","v":0.93351258586310326},{"$f":"($B$4+Y6)*C6*(1-D6)","v":0.20420543238266012},{"$f":"(($B$4+Y6)^2+G6^2/12)*(LO_DCR/1000+LO_DCR/1000*(R6-25)*(Constants!$C$32/100))","v":8.5840864122945892E-2},{"$f":"0.5*C_SNUB*10^-12*(B6+$D$4)^2*fsw*10^6","v":0.15912319999999996},{"$f":"IF($I$4=\"None\",V_cs^2/RFB_1,VLOOKUP($I$4,Design!$A$99:$F$102,5))","v":7.0052539404553429E-2},{"$f":"$A6+M6*RthJA","v":36.231298781046306},{"$f":"MIN(L6*RthJA_IC+$A6,190)","v":67.008066363839646},{"$f":"IF(Reset=1,Rdson,Rdson+Rdson*TCR_RdsON/100*(R6-25))","v":190.32774370928607},{"$f":"(Max_Duty_Dropout*(B6+C6-($B$4+Y6)*S6/1000)-(C6+($B$4+Y6)*LO_DCR/1000))/(1-Max_Duty_Dropout)","v":22.176059809097818},{"$f":"IF(Reset=1,VOUT,IF(T6>VOUT,VOUT,T6))","v":12.399999999999999},{"$f":"SUM(L6:P6)","v":1.4527346217732628},{"$f":"U6*$B$4","v":4.3432574430823117},{"$f":"V6+W6","v":5.7959920648555743},{"$f":"IF(Reset=1,W6/B6/0.8,$B$4/(1-D6))","v":1.136828442203577},{"$f":"W6/(W6+V6)","v":0.749355312167864},{"$f":"IF(R6>=TSD,\"TSD\",IF(OR(E6=Constants!$C$19,Efficiency!F6=Min_tOFF_typ),IF(E6=Constants!$C$19,\"Pulse Skip\",\"Dropout\"),\"Normal\"))","v":"Normal"}]
[{"$f":"25","v":25},{"$f":"($B$25-$B$6)/19+B6","v":6.6315789473684212},{"$f":"IF(Reset=1,VF,FORECAST($B$4+Y7, OFFSET(Design!$C$16:$C$20,MATCH($B$4+Y7,Design!$B$16:$B$20,1)-1,0,2), OFFSET(Design!$B$16:$B$20,MATCH($B$4+Y7,Design!$B$16:$B$20,1)-1,0,2))+(Q7-25)*Design!$B$21/1000)","v":0.44195714549625087},{"$f":"IF(Reset=1,$D$4/(B7+$D$4),MIN(($D$4+C7+Y7*LO_DCR/1000*(1+(R7-25)*(Constants!$C$32/100)))/(B7-Y7*S7/1000+C7+$D$4),(Tsw-Min_tOFF_typ)/Tsw))","v":0.66840008841447862},{"$f":"IF(D7>=(Tsw-Min_tOFF_typ)/Tsw,Tsw-Min_tOFF_typ,IF(Tsw*Efficiency!D7>Constants!$C$19,Tsw*Efficiency!D7,Constants!$C$19))","v":334.20004420723933},{"$f":"IF(E7=Constants!$C$19,Tsw-Constants!$C$19,IF(Tsw*(1-Efficiency!D7)>Min_tOFF_typ,Tsw*(1-Efficiency!D7),Min_tOFF_typ))","v":165.7999557927607},{"$f":"IF(Reset=1,(B7)/(L_buckboost*micro)*D7*Tsw*nano,(B7-($B$4+Y7)*(S7/1000+LO_DCR/1000*(1+(R7-A7)*(Constants!$C$32/100))))/(L_buckboost*micro)*D7*Tsw*nano)","v":0.44878272302702987},9.5157894736842095E-5,0.57387906504930053,0.1432225580993596,0.19031578947368419,0.90751257051708112,0.20613313340364173,{"$f":"(($B$4+Y7)^2+G7^2/12)*(LO_DCR/1000+LO_DCR/1000*(R7-25)*(Constants!$C$32/100))","v":7.6638341440250377E-2},0.17023446869806091,{"$f":"IF($I$4=\"None\",V_cs^2/RFB_1,VLOOKUP($I$4,Design!$A$99:$F$102,5))","v":7.0052539404553429E-2},36.337322337200291,65.838065673268659,189.2045430463379,{"$f":"(Max_Duty_Dropout*(B7+C7-$B$4*S7/1000)-(C7+$B$4*LO_DCR/1000))/(1-Max_Duty_Dropout)","v":25.761304993474692},12.399999999999999,1.4305710534635874,4.3432574430823117,5.7738284965458995,1.0562810326094809,0.7522318069683912,{"$f":"IF(R7>=TSD,\"TSD\",IF(OR(E7=Constants!$C$19,Efficiency!F7=Min_tOFF_typ),IF(E7=Constants!$C$19,\"Pulse Skip\",\"Dropout\"),\"Normal\"))","v":"Normal"}]
[{"$f":"25","v":25},{"$f":"($B$25-$B$6)/19+B7","v":7.2631578947368425},{"$f":"IF(Reset=1,VF,FORECAST($B$4+Y8, OFFSET(Design!$C$16:$C$20,MATCH($B$4+Y8,Design!$B$16:$B$20,1)-1,0,2), OFFSET(Design!$B$16:$B$20,MATCH($B$4+Y8,Design!$B$16:$B$20,1)-1,0,2))+(Q8-25)*Design!$B$21/1000)","v":0.43891711450051313},{"$f":"IF(Reset=1,$D$4/(B8+$D$4),MIN(($D$4+C8+Y8*LO_DCR/1000*(1+(R8-25)*(Constants!$C$32/100)))/(B8-Y8*S8/1000+C8+$D$4),(Tsw-Min_tOFF_typ)/Tsw))","v":0.64658847666851338},{"$f":"IF(D8>=(Tsw-Min_tOFF_typ)/Tsw,Tsw-Min_tOFF_typ,IF(Tsw*Efficiency!D8>Constants!$C$19,Tsw*Efficiency!D8,Constants!$C$19))","v":323.2942383342567},{"$f":"IF(E8=Constants!$C$19,Tsw-Constants!$C$19,IF(Tsw*(1-Efficiency!D8)>Min_tOFF_typ,Tsw*(1-Efficiency!D8),Min_tOFF_typ))","v":176.70576166574332},{"$f":"IF(Reset=1,(B8)/(L_buckboost*micro)*D8*Tsw*nano,(B8-($B$4+Y8)*(S8/1000+LO_DCR/1000*(1+(R8-A8)*(Constants!$C$32/100))))/(L_buckboost*micro)*D8*Tsw*nano)","v":0.47866506842686329},9.8315789473684204E-5,0.574792342421655,0.12211491534748391,0.19663157894736841,0.89363715250598097,0.20806846954549915,{"$f":"(($B$4+Y8)^2+G8^2/12)*(LO_DCR/1000+LO_DCR/1000*(R8-25)*(Constants!$C$32/100))","v":6.9698269424614837E-2},0.18172069584487532,{"$f":"IF($I$4=\"None\",V_cs^2/RFB_1,VLOOKUP($I$4,Design!$A$99:$F$102,5))","v":7.0052539404553429E-2},36.443765825002451,65.213671862769147,188.60512498825838,28.291500629086784,12.399999999999999,1.4231771267255238,4.3432574430823117,5.766434569807835,0.99109019909980123,0.75319634524649604,{"$f":"IF(R8>=TSD,\"TSD\",IF(OR(E8=Constants!$C$19,Efficiency!F8=Min_tOFF_typ),IF(E8=Constants!$C$19,\"Pulse Skip\",\"Dropout\"),\"Normal\"))","v":"Normal"}]
[{"$f":"25","v":25},7.8947368421052637,{"$f":"IF(Reset=1,VF,FORECAST($B$4+Y9, OFFSET(Design!$C$16:$C$20,MATCH($B$4+Y9,Design!$B$16:$B$20,1)-1,0,2), OFFSET(Design!$B$16:$B$20,MATCH($B$4+Y9,Design!$B$16:$B$20,1)-1,0,2))+(Q9-25)*Design!$B$21/1000)","v":0.43638498096477929},{"$f":"IF(Reset=1,$D$4/(B9+$D$4),MIN(($D$4+C9+Y9*LO_DCR/1000*(1+(R9-25)*(Constants!$C$32/100)))/(B9-Y9*S9/1000+C9+$D$4),(Tsw-Min_tOFF_typ)/Tsw))","v":0.62624825384616734},{"$f":"IF(D9>=(Tsw-Min_tOFF_typ)/Tsw,Tsw-Min_tOFF_typ,IF(Tsw*Efficiency!D9>Constants!$C$19,Tsw*Efficiency!D9,Constants!$C$19))","v":313.12412692308368},{"$f":"IF(E9=Constants!$C$19,Tsw-Constants!$C$19,IF(Tsw*(1-Efficiency!D9)>Min_tOFF_typ,Tsw*(1-Efficiency!D9),Min_tOFF_typ))","v":186.87587307691632},{"$f":"IF(Reset=1,(B9)/(L_buckboost*micro)*D9*Tsw*nano,(B9-($B$4+Y9)*(S9/1000+LO_DCR/1000*(1+(R9-A9)*(Constants!$C$32/100))))/(L_buckboost*micro)*D9*Tsw*nano)","v":0.50652299636618792},1.0147368421052631E-4,0.57898693609612606,0.10612611267731561,0.20294736842105263,0.8881618908787049,0.20997710318587487,{"$f":"(($B$4+Y9)^2+G9^2/12)*(LO_DCR/1000+LO_DCR/1000*(R9-25)*(Constants!$C$32/100))","v":6.4297254855135447E-2},0.19358188144044322,{"$f":"IF($I$4=\"None\",V_cs^2/RFB_1,VLOOKUP($I$4,Design!$A$99:$F$102,5))","v":7.0052539404553429E-2},36.548740675223115,64.967285089541718,188.36859368596004,30.820679944463695,12.399999999999999,1.4260706697647121,4.3432574430823117,5.769328112847024,0.93715333942173029,0.75281858790642076,{"$f":"IF(R9>=TSD,\"TSD\",IF(OR(E9=Constants!$C$19,Efficiency!F9=Min_tOFF_typ),IF(E9=Constants!$C$19,\"Pulse Skip\",\"Dropout\"),\"Normal\"))","v":"Normal"}]
[{"$f":"25","v":25},8.526315789473685,{"$f":"IF(Reset=1,VF,FORECAST($B$4+Y10, OFFSET(Design!$C$16:$C$20,MATCH($B$4+Y10,Design!$B$16:$B$20,1)-1,0,2), OFFSET(Design!$B$16:$B$20,MATCH($B$4+Y10,Design!$B$16:$B$20,1)-1,0,2))+(Q10-25)*Design!$B$21/1000)","v":0.43423880488988265},{"$f":"IF(Reset=1,$D$4/(B10+$D$4),MIN(($D$4+C10+Y10*LO_DCR/1000*(1+(R10-25)*(Constants!$C$32/100)))/(B10-Y10*S10/1000+C10+$D$4),(Tsw-Min_tOFF_typ)/Tsw))","v":0.60721299087888836},{"$f":"IF(D10>=(Tsw-Min_tOFF_typ)/Tsw,Tsw-Min_tOFF_typ,IF(Tsw*Efficiency!D10>Constants!$C$19,Tsw*Efficiency!D10,Constants!$C$19))","v":303.60649543944419},{"$f":"IF(E10=Constants!$C$19,Tsw-Constants!$C$19,IF(Tsw*(1-Efficiency!D10)>Min_tOFF_typ,Tsw*(1-Efficiency!D10),Min_tOFF_typ))","v":196.39350456055581},{"$f":"IF(Reset=1,(B10)/(L_buckboost*micro)*D10*Tsw*nano,(B10-($B$4+Y10)*(S10/1000+LO_DCR/1000*(1+(R10-A10)*(Constants!$C$32/100))))/(L_buckboost*micro)*D10*Tsw*nano)","v":0.5325875677850932},1.0463157894736841E-4,0.58575173053956697,9.3671431202629121E-2,0.20926315789473685,0.88879095121588025,0.21183963793586891,{"$f":"(($B$4+Y10)^2+G10^2/12)*(LO_DCR/1000+LO_DCR/1000*(R10-25)*(Constants!$C$32/100))","v":5.99897860286044E-2},0.20581802548476452,{"$f":"IF($I$4=\"None\",V_cs^2/RFB_1,VLOOKUP($I$4,Design!$A$99:$F$102,5))","v":7.0052539404553429E-2},36.651180086472792,64.995592804714619,188.39576909252602,33.34910383588749,12.399999999999999,1.4364909400696717,4.3432574430823117,5.7797483831519836,0.89173696911846545,0.75146133623099309,{"$f":"IF(R10>=TSD,\"TSD\",IF(OR(E10=Constants!$C$19,Efficiency!F10=Min_tOFF_typ),IF(E10=Constants!$C$19,\"Pulse Skip\",\"Dropout\"),\"Normal\"))","v":"Normal"}]
[{"$f":"25","v":25},9.1578947368421062,{"$f":"IF(Reset=1,VF,FORECAST($B$4+Y11, OFFSET(Design!$C$16:$C$20,MATCH($B$4+Y11,Design!$B$16:$B$20,1)-1,0,2), OFFSET(Design!$B$16:$B$20,MATCH($B$4+Y11,Design!$B$16:$B$20,1)-1,0,2))+(Q11-25)*Design!$B$21/1000)","v":0.43239364332491437},{"$f":"IF(Reset=1,$D$4/(B11+$D$4),MIN(($D$4+C11+Y11*LO_DCR/1000*(1+(R11-25)*(Constants!$C$32/100)))/(B11-Y11*S11/1000+C11+$D$4),(Tsw-Min_tOFF_typ)/Tsw))","v":0.58934679108400978},{"$f":"IF(D11>=(Tsw-Min_tOFF_typ)/Tsw,Tsw-Min_tOFF_typ,IF(Tsw*Efficiency!D11>Constants!$C$19,Tsw*Efficiency!D11,Constants!$C$19))","v":294.67339554200487},{"$f":"IF(E11=Constants!$C$19,Tsw-Constants!$C$19,IF(Tsw*(1-Efficiency!D11)>Min_tOFF_typ,Tsw*(1-Efficiency!D11),Min_tOFF_typ))","v":205.3266044579951},{"$f":"IF(Reset=1,(B11)/(L_buckboost*micro)*D11*Tsw*nano,(B11-($B$4+Y11)*(S11/1000+LO_DCR/1000*(1+(R11-A11)*(Constants!$C$32/100))))/(L_buckboost*micro)*D11*Tsw*nano)","v":0.55704689627064807},1.0778947368421052E-4,0.59459687130891059,8.3747026480157222E-2,0.21557894736842106,0.89403063463117305,0.21364535217904262,{"$f":"(($B$4+Y11)^2+G11^2/12)*(LO_DCR/1000+LO_DCR/1000*(R11-25)*(Constants!$C$32/100))","v":5.6486440256303574E-2},0.21842912797783934,{"$f":"IF($I$4=\"None\",V_cs^2/RFB_1,VLOOKUP($I$4,Design!$A$99:$F$102,5))","v":7.0052539404553429E-2},36.750494369847345,65.231378558402781,188.62212341606667,35.876947653022768,12.399999999999999,1.4526440944489123,4.3432574430823117,5.7959015375312237,0.85294036286082564,0.74936701649564796,{"$f":"IF(R11>=TSD,\"TSD\",IF(OR(E11=Constants!$C$19,Efficiency!F11=Min_tOFF_typ),IF(E11=Constants!$C$19,\"Pulse Skip\",\"Dropout\"),\"Normal\"))","v":"Normal"}]
[{"$f":"25","v":25},9.7894736842105274,{"$f":"IF(Reset=1,VF,FORECAST($B$4+Y12, OFFSET(Design!$C$16:$C$20,MATCH($B$4+Y12,Design!$B$16:$B$20,1)-1,0,2), OFFSET(Design!$B$16:$B$20,MATCH($B$4+Y12,Design!$B$16:$B$20,1)-1,0,2))+(Q12-25)*Design!$B$21/1000)","v":0.43078828295824334},{"$f":"IF(Reset=1,$D$4/(B12+$D$4),MIN(($D$4+C12+Y12*LO_DCR/1000*(1+(R12-25)*(Constants!$C$32/100)))/(B12-Y12*S12/1000+C12+$D$4),(Tsw-Min_tOFF_typ)/Tsw))","v":0.57253576679713847},{"$f":"IF(D12>=(Tsw-Min_tOFF_typ)/Tsw,Tsw-Min_tOFF_typ,IF(Tsw*Efficiency!D12>Constants!$C$19,Tsw*Efficiency!D12,Constants!$C$19))","v":286.26788339856921},{"$f":"IF(E12=Constants!$C$19,Tsw-Constants!$C$19,IF(Tsw*(1-Efficiency!D12)>Min_tOFF_typ,Tsw*(1-Efficiency!D12),Min_tOFF_typ))","v":213.73211660143076},{"$f":"IF(Reset=1,(B12)/(L_buckboost*micro)*D12*Tsw*nano,(B12-($B$4+Y12)*(S12/1000+LO_DCR/1000*(1+(R12-A12)*(Constants!$C$32/100))))/(L_buckboost*micro)*D12*Tsw*nano)","v":0.58005828110911184},1.1094736842105262E-4,0.60517275350192756,7.5688464704946903E-2,0.22189473684210526,0.90286690241740086,0.21538874466051358,{"$f":"(($B$4+Y12)^2+G12^2/12)*(LO_DCR/1000+LO_DCR/1000*(R12-25)*(Constants!$C$32/100))","v":5.3591096058675555E-2},0.23141518891966759,{"$f":"IF($I$4=\"None\",V_cs^2/RFB_1,VLOOKUP($I$4,Design!$A$99:$F$102,5))","v":7.0052539404553429E-2},36.846380956328247,65.629010608783034,189.00385018443171,38.404333984273464,12.399999999999999,1.4733144714608111,4.3432574430823117,5.8165719145431227,0.81939650107882389,0.74670398765687118,{"$f":"IF(R12>=TSD,\"TSD\",IF(OR(E12=Constants!$C$19,Efficiency!F12=Min_tOFF_typ),IF(E12=Constants!$C$19,\"Pulse Skip\",\"Dropout\"),\"Normal\"))","v":"Normal"}]
[{"$f":"25","v":25},10.421052631578949,{"$f":"IF(Reset=1,VF,FORECAST($B$4+Y13, OFFSET(Design!$C$16:$C$20,MATCH($B$4+Y13,Design!$B$16:$B$20,1)-1,0,2), OFFSET(Design!$B$16:$B$20,MATCH($B$4+Y13,Design!$B$16:$B$20,1)-1,0,2))+(Q13-25)*Design!$B$21/1000)","v":0.42937737365361234},{"$f":"IF(Reset=1,$D$4/(B13+$D$4),MIN(($D$4+C13+Y13*LO_DCR/1000*(1+(R13-25)*(Constants!$C$32/100)))/(B13-Y13*S13/1000+C13+$D$4),(Tsw-Min_tOFF_typ)/Tsw))","v":0.55668269946008153},{"$f":"IF(D13>=(Tsw-Min_tOFF_typ)/Tsw,Tsw-Min_tOFF_typ,IF(Tsw*Efficiency!D13>Constants!$C$19,Tsw*Efficiency!D13,Constants!$C$19))","v":278.34134973004075},{"$f":"IF(E13=Constants!$C$19,Tsw-Constants!$C$19,IF(Tsw*(1-Efficiency!D13)>Min_tOFF_typ,Tsw*(1-Efficiency!D13),Min_tOFF_typ))","v":221.65865026995922},{"$f":"IF(Reset=1,(B13)/(L_buckboost*micro)*D13*Tsw*nano,(B13-($B$4+Y13)*(S13/1000+LO_DCR/1000*(1+(R13-A13)*(Constants!$C$32/100))))/(L_buckboost*micro)*D13*Tsw*nano)","v":0.60175577373916478},1.1410526315789473E-4,0.61722258852195189,6.9039961810472797E-2,0.22821052631578947,0.914587181911372,0.21706752779497435,{"$f":"(($B$4+Y13)^2+G13^2/12)*(LO_DCR/1000+LO_DCR/1000*(R13-25)*(Constants!$C$32/100))","v":5.1166217735644649E-2},0.24477620831024932,{"$f":"IF($I$4=\"None\",V_cs^2/RFB_1,VLOOKUP($I$4,Design!$A$99:$F$102,5))","v":7.0052539404553429E-2},36.938714028723588,66.15642318601175,189.51016625857127,40.931351308517087,12.399999999999999,1.4976496751567938,4.3432574430823117,5.8409071182391052,0.79009480702914225,0.74359296512691342,{"$f":"IF(R13>=TSD,\"TSD\",IF(OR(E13=Constants!$C$19,Efficiency!F13=Min_tOFF_typ),IF(E13=Constants!$C$19,\"Pulse Skip\",\"Dropout\"),\"Normal\"))","v":"Normal"}]
[{"$f":"25","v":25},11.05263157894737,{"$f":"IF(Reset=1,VF,FORECAST($B$4+Y14, OFFSET(Design!$C$16:$C$20,MATCH($B$4+Y14,Design!$B$16:$B$20,1)-1,0,2), OFFSET(Design!$B$16:$B$20,MATCH($B$4+Y14,Design!$B$16:$B$20,1)-1,0,2))+(Q14-25)*Design!$B$21/1000)","v":0.42812653314410593},{"$f":"IF(Reset=1,$D$4/(B14+$D$4),MIN(($D$4+C14+Y14*LO_DCR/1000*(1+(R14-25)*(Constants!$C$32/100)))/(B14-Y14*S14/1000+C14+$D$4),(Tsw-Min_tOFF_typ)/Tsw))","v":0.54170346395567825},{"$f":"IF(D14>=(Tsw-Min_tOFF_typ)/Tsw,Tsw-Min_tOFF_typ,IF(Tsw*Efficiency!D14>Constants!$C$19,Tsw*Efficiency!D14,Constants!$C$19))","v":270.85173197783911},{"$f":"IF(E14=Constants!$C$19,Tsw-Constants!$C$19,IF(Tsw*(1-Efficiency!D14)>Min_tOFF_typ,Tsw*(1-Efficiency!D14),Min_tOFF_typ))","v":229.14826802216086},{"$f":"IF(Reset=1,(B14)/(L_buckboost*micro)*D14*Tsw*nano,(B14-($B$4+Y14)*(S14/1000+LO_DCR/1000*(1+(R14-A14)*(Constants!$C$32/100))))/(L_buckboost*micro)*D14*Tsw*nano)","v":0.62225522219527529},1.1726315789473684E-4,0.63055320021228622,6.3479423029079121E-2,0.23452631578947369,0.92867620218873381,0.2186814151568176,{"$f":"(($B$4+Y14)^2+G14^2/12)*(LO_DCR/1000+LO_DCR/1000*(R14-25)*(Constants!$C$32/100))","v":4.9112564070288321E-2},0.25851218614958454,{"$f":"IF($I$4=\"None\",V_cs^2/RFB_1,VLOOKUP($I$4,Design!$A$99:$F$102,5))","v":7.0052539404553429E-2},37.027477833624971,66.790429098493021,190.11881193455329,43.458065194996273,12.399999999999999,1.5250349069699778,4.3432574430823117,5.8682923500522897,0.76427088026014078,0.74012288141091176,{"$f":"IF(R14>=TSD,\"TSD\",IF(OR(E14=Constants!$C$19,Efficiency!F14=Min_tOFF_typ),IF(E14=Constants!$C$19,\"Pulse Skip\",\"Dropout\"),\"Normal\"))","v":"Normal"}]
[{"$f":"25","v":25},11.684210526315791,{"$f":"IF(Reset=1,VF,FORECAST($B$4+Y15, OFFSET(Design!$C$16:$C$20,MATCH($B$4+Y15,Design!$B$16:$B$20,1)-1,0,2), OFFSET(Design!$B$16:$B$20,MATCH($B$4+Y15,Design!$B$16:$B$20,1)-1,0,2))+(Q15-25)*Design!$B$21/1000)","v":0.42700917839028113},{"$f":"IF(Reset=1,$D$4/(B15+$D$4),MIN(($D$4+C15+Y15*LO_DCR/1000*(1+(R15-25)*(Constants!$C$32/100)))/(B15-Y15*S15/1000+C15+$D$4),(Tsw-Min_tOFF_typ)/Tsw))","v":0.52752450434754528},{"$f":"IF(D15>=(Tsw-Min_tOFF_typ)/Tsw,Tsw-Min_tOFF_typ,IF(Tsw*Efficiency!D15>Constants!$C$19,Tsw*Efficiency!D15,Constants!$C$19))","v":263.76225217377265},{"$f":"IF(E15=Constants!$C$19,Tsw-Constants!$C$19,IF(Tsw*(1-Efficiency!D15)>Min_tOFF_typ,Tsw*(1-Efficiency!D15),Min_tOFF_typ))","v":236.23774782622735},{"$f":"IF(Reset=1,(B15)/(L_buckboost*micro)*D15*Tsw*nano,(B15-($B$4+Y15)*(S15/1000+LO_DCR/1000*(1+(R15-A15)*(Constants!$C$32/100))))/(L_buckboost*micro)*D15*Tsw*nano)","v":0.64165781799978083},1.2042105263157894E-4,0.64501629577538533,5.8773422805918983E-2,0.24084210526315789,0.94475224489709375,0.22023136658437015,{"$f":"(($B$4+Y15)^2+G15^2/12)*(LO_DCR/1000+LO_DCR/1000*(R15-25)*(Constants!$C$32/100))","v":4.735677684952843E-2},0.27262312243767317,{"$f":"IF($I$4=\"None\",V_cs^2/RFB_1,VLOOKUP($I$4,Design!$A$99:$F$102,5))","v":7.0052539404553429E-2},37.112725162140357,67.513851020369216,190.81329697955445,45.984525330404175,12.399999999999999,1.5550160501732191,4.3432574430823117,5.8982734932555303,0.7413351596977098,0.73636080931965509,{"$f":"IF(R15>=TSD,\"TSD\",IF(OR(E15=Constants!$C$19,Efficiency!F15=Min_tOFF_typ),IF(E15=Constants!$C$19,\"Pulse Skip\",\"Dropout\"),\"Normal\"))","v":"Normal"}]
{"$rows_left_out":37}
{"sheet":"Snubber","index":2,"n_rows":33,"n_cols":11,"rows_kept":33,"cut":false,"hidden":false,"merged":[[7,5,7,8],[8,0,8,8],[9,3,9,8],[10,0,10,8],[0,0,0,8],[1,0,1,8],[2,5,2,8],[3,5,3,8],[5,5,5,8],[6,5,6,8],[16,3,16,8],[11,3,11,8],[12,3,12,8],[13,3,13,8],[14,3,14,8],[15,3,15,8]]}
["ALLEGRO ALT80802 DESIGN SPREADSHEET"]
["INSTRUCTIONS:   Enter design goals and component values in the white boxes."]
["VARIABLES","MIN","TYP","MAX","UNITS","COMMENTS"]
["LX resonance, FLX","‒",135,"‒","MHz","Measured LX resonant frequency"]
["LX resonance, TLX","‒",{"$f":"1000000000/(C4*1000000)","v":7.4074074074074074},"‒","ns","LX resonance period"]
["Capacitance of D1","‒",120,"‒","pF","Estimated D1 capacitance at VinTYP"]
["Capacitance, other","‒",50,"‒","pF","Estimated FET + PCB trace capacitance"]
["Snubber ‒3dB freq.","‒",2.5,"‒","Multiple of fLX","Start with 2.5, decrease for more damping"]
["**** Note:  The applications schematic is shown at the bottom of this TAB. ****\nSchematic component values are shown in BLUE."]
["COMPONENT","VALUE","UNITS","COMMENTS"]
["Snubber Component Calculations:"]
["LEQ",{"$f":"1000000000*(C5/1000000000)^2/(4*3.14^2*(C6/1000000000000+C7/1000000000000))","v":8.1839742483459119},"nH","Equivalent inductance, given fLX and CTOTAL"]
["RSNUB",{"$f":"SQRT(B12*0.000000001/(C6*0.000000000001+C7*0.000000000001))","v":6.9383733677476647},"Ω","Snubber resistance, use the closest available standard value"]
["RSNUB = ",6.81,"Ω","Enter the snubber resister value"]
["CSNUB",{"$f":"1000000000000/C8*(C5/1000000000)/B14","v":435.09000924566271},"pF","Snubber capacitance, use the closest available standard value"]
{"$rows_left_out":19}
{"sheet":"Constants","index":3,"n_rows":98,"n_cols":24,"rows_kept":98,"cut":false,"hidden":false,"merged":[[0,22,0,23],[1,17,1,18],[1,19,1,20],[9,22,9,23],[46,17,46,18],[1,5,1,8],[0,0,0,8],[56,7,56,8],[56,1,56,2],[0,17,0,20],[8,17,8,18],[21,17,21,18]]}
["These values are all derived from the data sheet or lab measurements.",null,null,null,null,null,null,null,null,null,null,null,null,null,null,null,null,"Std. Resistors",null,null,null,null,"C values up to 10nF"]
["PARAMETER","MIN","TYP","MAX","UNITS","COMMENTS",null,null,null,null,null,null,null,null,null,null,null,"E6",null,"E96",null,null,1,1.2]
["Input Voltage",3.8,null,50,"V","Datasheet values",null,null,null,null,null,null,null,null,null,null,1,100,150,100,102,1,1.2,1.5]
["VCS",0.192,0.2,0.20799999999999999,"V","Datasheet values",null,null,null,null,null,null,null,null,null,null,{"$f":"Q3+1","v":2},150,220,102,105,{"$f":"V3+1","v":2},1.5,1.8]
["VCS tol",{"$f":"100*(B4-C4)/C4","v":-4.0000000000000036},"‒",{"$f":"100*(D4-C4)/C4","v":3.9999999999999893},"%","Calculated values",null,null,null,null,null,null,null,null,null,null,{"$f":"Q4+1","v":3},220,330,105,107,{"$f":"V4+1","v":3},1.8,2.2000000000000002]
["UVLO Stop","‒",3,3.3,"V","Datasheet values",null,null,null,null,null,null,null,null,null,null,4,330,470,107,110,4,3.3,3.9]
["UVLO Hysteresis",300,"‒","‒","mV","Datasheet value",null,null,null,null,null,null,null,null,null,null,5,470,680,110,113,5,4.7,5.6]
["UVLO Multiplier","‒",0.5,"‒","‒","Chosen value, allows for margin",null,null,null,null,null,null,null,null,null,null,6,680,1000,113,115,6,6.8,8.1999999999999993]
["Maximum output Voltage ",16,18,20,"V","Datasheet values",null,null,null,null,null,null,null,null,null,null,null,"E12",null,115,118,7,8.1999999999999993,10]
["AVOL","‒",60,"‒","dB","Datasheet value",null,null,null,null,null,null,null,null,null,null,1,100,120,118,121,8,"C values greater than 10nF"]
["gm_EA",100,120,146,"µA/V","Datasheet values",null,null,null,null,null,null,null,null,null,null,2,120,150,121,124,9,1,1.5]
["Ro_EA",{"$f":"POWER(10,$C$10/20)/(D11/1000000)/1000000","v":6.8493150684931514},{"$f":"POWER(10,$C$10/20)/(C11/1000000)/1000000","v":8.3333333333333321},{"$f":"POWER(10,$C$10/20)/(B11/1000000)/1000000","v":10},"MΩ","Calculated values",null,null,null,null,null,null,null,null,null,null,3,150,180,124,127,10,1.5,2.2000000000000002]
["gm_power","‒",9,"‒","A/V","Datasheet value",null,null,null,null,null,null,null,null,null,null,4,180,220,127,130,11,2.2000000000000002,3.3]
["Slope comp @ 400kHz","‒",0.62,"‒","A/µs","Design supplied value",null,null,null,null,null,null,null,null,null,null,5,220,270,130,133,12,3.3,4.7]
["Slope Comp @ 2MHz","‒",3.1,"‒","A/µs","Datasheet values",null,null,null,null,null,null,null,null,null,null,6,270,330,133,137,13,4.7,6.8]
{"$rows_left_out":84}
{"sheet":"Sheet1","index":4,"n_rows":0,"n_cols":0,"rows_kept":0,"cut":false,"hidden":true,"merged":[]}