{"text_format":"1","workbook":"xlsx","n_sheets":5,"sheets":["Design","Efficiency","Snubber","Constants","Sheet1"],"not_rendered":{"charts":4,"images":6,"macros":1,"external_links":0,"defined_names":77,"comments":0,"pivot_tables":0},"unopened":[],"bounds":{"document_bytes":16777216,"sheet_cells":100000,"rows_first":2000,"rows_last":500,"rows_between":2000,"halvings":0,"cell_chars":16384,"cell_head_chars":4096},"cells_cut":0,"cells_raw":0,"read":"whole","date_system":"1900"}

{"sheet":"Design","index":0,"n_rows":95,"n_cols":11,"rows_kept":95,"cut":false,"hidden":false,"merged":[[84,3,84,5],[85,3,85,5],[86,3,86,5],[79,3,79,5],[80,3,80,5],[81,3,81,5],[82,3,82,5],[83,3,83,5],[64,3,64,5],[65,3,65,5],[68,3,68,5],[69,3,69,5],[74,0,74,5],[77,3,77,5],[78,3,78,5],[70,3,70,5],[71,3,71,5],[72,3,72,5],[73,3,73,5],[75,3,75,5],[76,3,76,5],[42,3,42,5],[45,3,45,5],[57,3,57,5],[63,3,63,5],[50,3,50,5],[52,3,52,5],[60,3,60,5],[62,3,62,5],[58,3,58,5],[54,3,54,5],[46,0,46,5],[94,0,97,5],[61,0,61,5],[35,3,35,5],[1,0,1,5],[15,1,15,2],[38,3,38,5],[39,3,39,5],[16,1,16,2],[28,3,28,5],[30,3,30,5],[32,3,32,5],[13,0,13,2],[13,4,13,5],[15,4,15,5],[19,0,19,5],[17,0,17,5],[0,0,0,5],[56,0,56,5],[23,0,23,5],[16,8,16,11],[29,4,29,5],[44,10,44,13],[44,3,44,5],[27,0,27,5],[34,0,34,5],[33,3,33,5],[55,3,55,5],[47,3,47,5],[49,3,49,5],[18,3,18,5],[40,3,40,5],[41,3,41,5]]}
["ALLEGRO ALT80802 DESIGN SPREADSHEET BUCK- Rev. 2.0"]
["INSTRUCTIONS:   Enter design goals and component values in the white boxes.\nEnsure \"Iterative Calculation\" is enabled under File -> Options -> Formulas"]
["VARIABLES","MIN","TYP","MAX","UNITS","COMMENTS"]
["Vin",10,13.5,18,"V",{"$f":"IF(COUNTIF(Efficiency!Z5:Z48,\"dropout\")<1,IF(B4<Constants!B3,\"Vin_min is lower than minimum VIN level\",IF(D4>Constants!D3,\"Vin_max is higher than maximum VIN level\",\"Steady-state input operating voltages\")),\"Circuit may operate in dropout condition\")","v":"Steady-state input operating voltages"}]
["LED Current Target","‒",0.7,"‒","A",{"$f":"IF(COUNTIF(Efficiency!Z5:Z48,\"TSD\")>0,\"IC may overheat!\",\"Desired output Current\")","v":"Desired output Current"}]
["Number of LEDs","‒",2,"‒","‒"]
["LED Forward Voltage","‒",3.05,"‒","V","Typical value @ target LED current "]
["RLED ","‒",0.9,"‒","Ω","LED resistance @ operating current "]
["CS Resistor Tolerance","‒",1,1.6,"%","1% initial tolerance + 100ppm @ 60°C rise"]
["Lo_tolerance",-20,"‒",20,"%","Output inductor tolerances"]
["RTHJA","‒",45,"‒","°C/W","Thermal resistance, 4 layer PCB"]
["Desired fsw","‒",2,"‒","MHz","Desired Switching Frequency"]
["TAMB","‒","‒",85,"°C","Maximum steady-state ambient temperature"]
["DIODE (D1) CHARACTERIZATION",null,null,"UNITS","COMMENTS"]
["VF_nominal",0.35,0.42,"A   |   VF","VF at nominal output current"]
{"$rows_left_out":81}
{"sheet":"Efficiency","index":1,"n_rows":51,"n_cols":27,"rows_kept":51,"cut":false,"hidden":false,"merged":[[3,1,3,2],[3,3,3,6],[0,0,1,25],[2,0,2,11]]}
["INSTRUCTIONS:  No values need to be entered here, all values are derived from the DESIGN tab"]
[null,null,null,null,null,null,null,null,null,null,null,null,null,null,null,null,null,null,null,null,null,null,null,null,null,null,0]
["If iteration error occurs, please set 'Reset' to 1 and then 0",null,null,null,null,null,null,null,null,null,null,null,"Reset=",0,null,"If not in normal operation, the calculation result is not valid",null,null,null,null,null,null,null,null,null,null,1]
[null,{"$f":"IOUT","v":0.7},null,{"$f":"IF($I$4=\"None\",VOUT,VOUT-V_cs+VLOOKUP($I$4,Design!A90:F93,6))","v":6.3999999999999995},null,null,null,"Binning?","BIN1"]
["T (°C)","VIN","VF","Duty","TON(ns)","TOFF","ΔIL","PIQ","Psw","Pcond","PDRIVER","PIC","PD1","PIND","PSNUB","PSENSE","TJD1","TJIC","RDSon","VOSAT","VOUT","PLOSS_tol","POUT","PIN","Efficiency","Operating Condition "]
[25,{"$f":"Design!B4","v":10},{"$f":"IF(RESET=1,VF,VF+(Q6-25)*Design!$B$16/1000)","v":0.41462364767885967},{"$f":"IF(RESET=1,$D$4/B6,MIN(($D$4+C6+IOUT*DCR*(1+(R6-25)*TCR_Cu/100)/1000)/(B6-IOUT*S6/1000+C6),(Tsw-Min_tOFF_typ)/Tsw))","v":0.66319934809175851},{"$f":"IF(D6>=(Tsw-Min_tOFF_typ)/Tsw,Tsw-Min_tOFF_typ,IF(Tsw*D6>Constants!$C$19,Tsw*D6,Constants!$C$19))","v":331.59967404587928},{"$f":"IF(E6=Constants!$C$19,Tsw-Constants!$C$19,IF(Tsw*(1-Efficiency!D6)>Min_tOFF_typ,Tsw*(1-Efficiency!D6),Min_tOFF_typ))","v":168.40032595412075},{"$f":"(B6-VOUT)/(Lout*micro)*D6*Tsw*nano","v":0.37179357393022833},{"$f":"B6*Iq*milli","v":0.05},{"$f":"B6*$B$4*(B6/(Slew_rise*10^9)*fsw*10^6/2+B6/(Slew_fall*10^9)*fsw*10^6/2)","v":0.105},{"$f":"(D6*($B$4^2+G6^2/12))*S6*10^-3","v":5.4335813793280813E-2},{"$f":"Qg*10^-9*B6*fsw*10^6","v":9.9999999999999992E-2},{"$f":"SUM(H6:K6)","v":0.30933581379328079},{"$f":"($B$4)*C6*(1-D6)","v":9.7751860384369088E-2},{"$f":"($B$4^2+G6^2/12)*DCR/1000+($B$4^2+G6^2/12)^2*DCR/1000*(R6-25)*(Constants!$C$32/100)","v":1.1521637338937799E-2},{"$f":"0.5*C_SNUB*10^-12*B6^2*fsw*10^6","v":4.7000000000000007E-2},{"$f":"IF($I$4=\"None\",V_cs^2/RFB_1,VLOOKUP($I$4,Design!$A$90:$F$93,5))","v":0.20979020979020982},{"$f":"$A6+M6*RthJA","v":30.376352321140299},{"$f":"MIN(L6*RthJA_IC+$A6,190)","v":38.920111620697639},{"$f":"IF(RESET=1,Rdson,Rdson+Rdson*TCR_RdsON/100*(Efficiency!R6-25))","v":163.36330715586973},{"$f":"(1-Min_tOFF_typ*10^-9*fsw*10^6) * (B6+C6-$B$4*S6/1000) - (C6+$B$4*DCR/1000)","v":7.8099398184569413},{"$f":"IF(T6>$D$4,$D$4,T6)","v":6.3999999999999995},{"$f":"SUM(L6:P6)","v":0.67539952130679748},{"$f":"U6*$B$4","v":4.4799999999999995},{"$f":"V6+W6","v":5.1553995213067969},{"$f":"W6/(W6+V6)","v":0.86899181750794818},{"$f":"IF(R6>Constants!$C$31,\"TSD\",IF(OR(E6=Constants!$C$19,Efficiency!F6=Min_tOFF_typ),IF(E6=Constants!$C$19,\"Pulse Skip\",\"Dropout\"),\"Normal\"))","v":"Normal"}]
[{"$f":"25","v":25},{"$f":"($B$25-$B$6)/19+B6","v":10.421052631578947},{"$f":"IF(RESET=1,VF,VF+(Q7-25)*Design!$B$16/1000)","v":0.41421383229262188},0.63716791037693432,{"$f":"IF(F7=Min_tOFF_typ,Tsw-Min_tOFF_typ,IF(Tsw*Efficiency!D7>Constants!$C$19,Tsw*Efficiency!D7,Constants!$C$19))","v":318.58395518846714},{"$f":"IF(E7=Constants!$C$19,Tsw-Constants!$C$19,IF(Tsw*(1-Efficiency!D7)>Min_tOFF_typ,Tsw*(1-Efficiency!D7),Min_tOFF_typ))","v":181.41604481153283},0.39784886269947334,5.2105263157894731E-2,0.11402825484764541,{"$f":"(D7*($B$4^2+G7^2/12))*S7*10^-3","v":5.2565005452425137E-2},0.10421052631578946,{"$f":"SUM(H7:K7)","v":0.32290904977375473},{"$f":"($B$4)*C7*(1-D7)","v":0.10520304922505704},{"$f":"($B$4^2+G7^2/12)*DCR/1000+($B$4^2+G7^2/12)^2*DCR/1000*(R7-A7)*(Constants!$C$32/100)","v":1.1574647173697368E-2},5.1041218836565101E-2,{"$f":"IF($I$4=\"None\",V_cs^2/RFB_1,VLOOKUP($I$4,Design!$A$90:$F$93,5))","v":0.20979020979020982},30.786167707378137,39.530907239818958,{"$f":"IF(RESET=1,Rdson,Rdson+Rdson*TCR_RdsON/100*(Efficiency!R7-25))","v":163.94967095022619},8.1465355230725081,{"$f":"IF(T7>$D$4,$D$4,T7)","v":6.3999999999999995},{"$f":"SUM(L7:P7)","v":0.70051817479928402},4.4799999999999995,{"$f":"V7+W7","v":5.1805181747992837},0.86477835784710366,{"$f":"IF(R7>Constants!$C$31,\"TSD\",IF(OR(E7=Constants!$C$19,Efficiency!F7=Min_tOFF_typ),IF(E7=Constants!$C$19,\"Pulse Skip\",\"Dropout\"),\"Normal\"))","v":"Normal"}]
[{"$f":"25","v":25},{"$f":"($B$25-$B$6)/19+B7","v":10.842105263157894},{"$f":"IF(RESET=1,VF,VF+(Q8-25)*Design!$B$16/1000)","v":0.41383568638630597},0.61310238053112442,{"$f":"IF(F8=Min_tOFF_typ,Tsw-Min_tOFF_typ,IF(Tsw*Efficiency!D8>Constants!$C$19,Tsw*Efficiency!D8,Constants!$C$19))","v":306.55119026556224},{"$f":"IF(E8=Constants!$C$19,Tsw-Constants!$C$19,IF(Tsw*(1-Efficiency!D8)>Min_tOFF_typ,Tsw*(1-Efficiency!D8),Min_tOFF_typ))","v":193.44880973443779},0.42193568931288711,5.4210526315789466E-2,0.1234288088642659,5.093338053035041E-2,0.10842105263157893,0.33699376834198469,0.11207842933989094,{"$f":"($B$4^2+G8^2/12)*DCR/1000+($B$4^2+G8^2/12)^2*DCR/1000*(R8-A8)*(Constants!$C$32/100)","v":1.1627753245520716E-2},5.5249085872576167E-2,{"$f":"IF($I$4=\"None\",V_cs^2/RFB_1,VLOOKUP($I$4,Design!$A$90:$F$93,5))","v":0.20979020979020982},31.164313613694002,40.164719575389313,{"$f":"IF(RESET=1,Rdson,Rdson+Rdson*TCR_RdsON/100*(Efficiency!R8-25))","v":164.55813079237373},8.4831125200053261,6.3999999999999995,0.7257392465901823,4.4799999999999995,5.2057392465901815,0.86058862877821829,{"$f":"IF(R8>Constants!$C$31,\"TSD\",IF(OR(E8=Constants!$C$19,Efficiency!F8=Min_tOFF_typ),IF(E8=Constants!$C$19,\"Pulse Skip\",\"Dropout\"),\"Normal\"))","v":"Normal"}]
[{"$f":"25","v":25},11.263157894736841,{"$f":"IF(RESET=1,VF,VF+(Q9-25)*Design!$B$16/1000)","v":0.41348567800830927},0.59078832081835075,{"$f":"IF(F9=Min_tOFF_typ,Tsw-Min_tOFF_typ,IF(Tsw*Efficiency!D9>Constants!$C$19,Tsw*Efficiency!D9,Constants!$C$19))","v":295.39416040917536},{"$f":"IF(E9=Constants!$C$19,Tsw-Constants!$C$19,IF(Tsw*(1-Efficiency!D9)>Min_tOFF_typ,Tsw*(1-Efficiency!D9),Min_tOFF_typ))","v":204.60583959082462},0.44426904827089686,5.6315789473684208E-2,0.13320166204986145,4.9424827214512759E-2,0.11263157894736842,0.35157385768542682,0.11844221803074007,{"$f":"($B$4^2+G9^2/12)*DCR/1000+($B$4^2+G9^2/12)^2*DCR/1000*(R9-A9)*(Constants!$C$32/100)","v":1.1680760346503168E-2},5.9623601108033226E-2,{"$f":"IF($I$4=\"None\",V_cs^2/RFB_1,VLOOKUP($I$4,Design!$A$90:$F$93,5))","v":0.20979020979020982},31.514321991690704,40.820823595844203,{"$f":"IF(RESET=1,Rdson,Rdson+Rdson*TCR_RdsON/100*(Efficiency!R9-25))","v":165.18799065201043},8.819671905422684,6.3999999999999995,0.75111064696091312,4.4799999999999995,5.2311106469609125,0.85641468941260468,{"$f":"IF(R9>Constants!$C$31,\"TSD\",IF(OR(E9=Constants!$C$19,Efficiency!F9=Min_tOFF_typ),IF(E9=Constants!$C$19,\"Pulse Skip\",\"Dropout\"),\"Normal\"))","v":"Normal"}]
[{"$f":"25","v":25},11.684210526315788,{"$f":"IF(RESET=1,VF,VF+(Q10-25)*Design!$B$16/1000)","v":0.4131607812793352},0.57004136708588182,{"$f":"IF(F10=Min_tOFF_typ,Tsw-Min_tOFF_typ,IF(Tsw*Efficiency!D10>Constants!$C$19,Tsw*Efficiency!D10,Constants!$C$19))","v":285.0206835429409},{"$f":"IF(E10=Constants!$C$19,Tsw-Constants!$C$19,IF(Tsw*(1-Efficiency!D10)>Min_tOFF_typ,Tsw*(1-Efficiency!D10),Min_tOFF_typ))","v":214.9793164570591},0.46503374683321924,5.8421052631578936E-2,0.14334681440443209,4.8025748089418459E-2,0.11684210526315789,0.36663572038858738,0.12434943128481435,{"$f":"($B$4^2+G10^2/12)*DCR/1000+($B$4^2+G10^2/12)^2*DCR/1000*(R10-A10)*(Constants!$C$32/100)","v":1.1733533443549615E-2},6.4164764542936265E-2,{"$f":"IF($I$4=\"None\",V_cs^2/RFB_1,VLOOKUP($I$4,Design!$A$90:$F$93,5))","v":0.20979020979020982},31.839218720664789,41.498607417486433,{"$f":"IF(RESET=1,Rdson,Rdson+Rdson*TCR_RdsON/100*(Efficiency!R10-25))","v":165.83866312078698},9.1562146134491229,6.3999999999999995,0.77667365945009748,4.4799999999999995,5.2566736594500973,0.85224997597980123,{"$f":"IF(R10>Constants!$C$31,\"TSD\",IF(OR(E10=Constants!$C$19,Efficiency!F10=Min_tOFF_typ),IF(E10=Constants!$C$19,\"Pulse Skip\",\"Dropout\"),\"Normal\"))","v":"Normal"}]
[{"$f":"25","v":25},12.105263157894735,{"$f":"IF(RESET=1,VF,VF+(Q11-25)*Design!$B$16/1000)","v":0.41285838893503241},0.55070213838612525,{"$f":"IF(F11=Min_tOFF_typ,Tsw-Min_tOFF_typ,IF(Tsw*Efficiency!D11>Constants!$C$19,Tsw*Efficiency!D11,Constants!$C$19))","v":275.35106919306264},{"$f":"IF(E11=Constants!$C$19,Tsw-Constants!$C$19,IF(Tsw*(1-Efficiency!D11)>Min_tOFF_typ,Tsw*(1-Efficiency!D11),Min_tOFF_typ))","v":224.64893080693739},0.48438952044648803,6.0526315789473671E-2,0.15386426592797778,4.6724571894221419E-2,0.12105263157894734,0.38216778519062022,0.1298474739085016,{"$f":"($B$4^2+G11^2/12)*DCR/1000+($B$4^2+G11^2/12)^2*DCR/1000*(R11-A11)*(Constants!$C$32/100)","v":1.1785982049547014E-2},6.8872576177285302E-2,{"$f":"IF($I$4=\"None\",V_cs^2/RFB_1,VLOOKUP($I$4,Design!$A$90:$F$93,5))","v":0.20979020979020982},32.141611064967591,42.197550333577908,{"$f":"IF(RESET=1,Rdson,Rdson+Rdson*TCR_RdsON/100*(Efficiency!R11-25))","v":166.50964832023479},9.4927414454694485,6.3999999999999995,0.80246402711616394,4.4799999999999995,5.2824640271161636,0.84808906923039662,{"$f":"IF(R11>Constants!$C$31,\"TSD\",IF(OR(E11=Constants!$C$19,Efficiency!F11=Min_tOFF_typ),IF(E11=Constants!$C$19,\"Pulse Skip\",\"Dropout\"),\"Normal\"))","v":"Normal"}]
[{"$f":"25","v":25},12.526315789473681,{"$f":"IF(RESET=1,VF,VF+(Q12-25)*Design!$B$16/1000)","v":0.41257624239078011},0.53263214612315901,{"$f":"IF(F12=Min_tOFF_typ,Tsw-Min_tOFF_typ,IF(Tsw*Efficiency!D12>Constants!$C$19,Tsw*Efficiency!D12,Constants!$C$19))","v":266.31607306157952},{"$f":"IF(E12=Constants!$C$19,Tsw-Constants!$C$19,IF(Tsw*(1-Efficiency!D12)>Min_tOFF_typ,Tsw*(1-Efficiency!D12),Min_tOFF_typ))","v":233.68392693842048},0.50247514263452708,6.2631578947368413E-2,0.16475401662049852,4.5511377019136157E-2,0.12526315789473683,0.39816013048173993,0.13497741107672517,{"$f":"($B$4^2+G12^2/12)*DCR/1000+($B$4^2+G12^2/12)^2*DCR/1000*(R12-A12)*(Constants!$C$32/100)","v":1.1838048712884517E-2},7.3747036011080305E-2,{"$f":"IF($I$4=\"None\",V_cs^2/RFB_1,VLOOKUP($I$4,Design!$A$90:$F$93,5))","v":0.20979020979020982},32.423757609219884,42.917205871678298,{"$f":"IF(RESET=1,Rdson,Rdson+Rdson*TCR_RdsON/100*(Efficiency!R12-25))","v":167.20051763681116},9.8292530932241764,6.3999999999999995,0.82851283607263981,4.4799999999999995,5.308512836072639,0.84392750631726976,{"$f":"IF(R12>Constants!$C$31,\"TSD\",IF(OR(E12=Constants!$C$19,Efficiency!F12=Min_tOFF_typ),IF(E12=Constants!$C$19,\"Pulse Skip\",\"Dropout\"),\"Normal\"))","v":"Normal"}]
[{"$f":"25","v":25},12.947368421052628,{"$f":"IF(RESET=1,VF,VF+(Q13-25)*Design!$B$16/1000)","v":0.4123123753670801},0.51571048112186646,{"$f":"IF(F13=Min_tOFF_typ,Tsw-Min_tOFF_typ,IF(Tsw*Efficiency!D13>Constants!$C$19,Tsw*Efficiency!D13,Constants!$C$19))","v":257.85524056093323},{"$f":"IF(E13=Constants!$C$19,Tsw-Constants!$C$19,IF(Tsw*(1-Efficiency!D13)>Min_tOFF_typ,Tsw*(1-Efficiency!D13),Min_tOFF_typ))","v":242.14475943906677},0.51941175251747773,6.4736842105263134E-2,0.17601606648199436,4.4377597708842434E-2,0.1294736842105263,0.41460419050662622,0.1397749933258165,{"$f":"($B$4^2+G13^2/12)*DCR/1000+($B$4^2+G13^2/12)^2*DCR/1000*(R13-A13)*(Constants!$C$32/100)","v":1.1889700483405118E-2},7.8788144044321287E-2,{"$f":"IF($I$4=\"None\",V_cs^2/RFB_1,VLOOKUP($I$4,Design!$A$90:$F$93,5))","v":0.20979020979020982},32.687624632919906,43.657188572798177,{"$f":"IF(RESET=1,Rdson,Rdson+Rdson*TCR_RdsON/100*(Efficiency!R13-25))","v":167.91090102988625},10.165750157191951,6.3999999999999995,0.854847238150379,4.4799999999999995,5.3348472381503784,0.83976162765501061,{"$f":"IF(R13>Constants!$C$31,\"TSD\",IF(OR(E13=Constants!$C$19,Efficiency!F13=Min_tOFF_typ),IF(E13=Constants!$C$19,\"Pulse Skip\",\"Dropout\"),\"Normal\"))","v":"Normal"}]
[{"$f":"25","v":25},13.368421052631575,{"$f":"IF(RESET=1,VF,VF+(Q14-25)*Design!$B$16/1000)","v":0.41206506810519278},0.49983111141749298,{"$f":"IF(F14=Min_tOFF_typ,Tsw-Min_tOFF_typ,IF(Tsw*Efficiency!D14>Constants!$C$19,Tsw*Efficiency!D14,Constants!$C$19))","v":249.9155557087465},{"$f":"IF(E14=Constants!$C$19,Tsw-Constants!$C$19,IF(Tsw*(1-Efficiency!D14)>Min_tOFF_typ,Tsw*(1-Efficiency!D14),Min_tOFF_typ))","v":250.08444429125353},0.53530556828843123,6.6842105263157883E-2,0.18765041551246525,4.3315792283969201E-2,0.13368421052631574,0.43149252358590806,0.14427148899649456,{"$f":"($B$4^2+G14^2/12)*DCR/1000+($B$4^2+G14^2/12)^2*DCR/1000*(R14-A14)*(Constants!$C$32/100)","v":1.1940922548542681E-2},8.3995900277008276E-2,{"$f":"IF($I$4=\"None\",V_cs^2/RFB_1,VLOOKUP($I$4,Design!$A$90:$F$93,5))","v":0.20979020979020982},32.9349318948072,44.417163561365868,{"$f":"IF(RESET=1,Rdson,Rdson+Rdson*TCR_RdsON/100*(Efficiency!R14-25))","v":168.64047701891124},10.502233161353633,6.3999999999999995,0.88149104519816346,4.4799999999999995,5.3614910451981626,0.83558845146488858,{"$f":"IF(R14>Constants!$C$31,\"TSD\",IF(OR(E14=Constants!$C$19,Efficiency!F14=Min_tOFF_typ),IF(E14=Constants!$C$19,\"Pulse Skip\",\"Dropout\"),\"Normal\"))","v":"Normal"}]
[{"$f":"25","v":25},13.789473684210522,{"$f":"IF(RESET=1,VF,VF+(Q15-25)*Design!$B$16/1000)","v":0.41183280992340005},0.48490066339330468,{"$f":"IF(F15=Min_tOFF_typ,Tsw-Min_tOFF_typ,IF(Tsw*Efficiency!D15>Constants!$C$19,Tsw*Efficiency!D15,Constants!$C$19))","v":242.45033169665234},{"$f":"IF(E15=Constants!$C$19,Tsw-Constants!$C$19,IF(Tsw*(1-Efficiency!D15)>Min_tOFF_typ,Tsw*(1-Efficiency!D15),Min_tOFF_typ))","v":257.54966830334769},0.55025011483945163,6.8947368421052618E-2,0.19965706371191122,4.2319458431351729E-2,0.13789473684210524,0.44881862740642076,0.14849436502909022,{"$f":"($B$4^2+G15^2/12)*DCR/1000+($B$4^2+G15^2/12)^2*DCR/1000*(R15-A15)*(Constants!$C$32/100)","v":1.1991713464533968E-2},8.9370304709141216E-2,{"$f":"IF($I$4=\"None\",V_cs^2/RFB_1,VLOOKUP($I$4,Design!$A$90:$F$93,5))","v":0.20979020979020982},33.167190076599965,45.196838233288929,{"$f":"IF(RESET=1,Rdson,Rdson+Rdson*TCR_RdsON/100*(Efficiency!R15-25))","v":169.38896470395736},10.838702565149523,6.3999999999999995,0.90846522039939592,4.4799999999999995,5.3884652203993957,0.83140557037277119,{"$f":"IF(R15>Constants!$C$31,\"TSD\",IF(OR(E15=Constants!$C$19,Efficiency!F15=Min_tOFF_typ),IF(E15=Constants!$C$19,\"Pulse Skip\",\"Dropout\"),\"Normal\"))","v":"Normal"}]
{"$rows_left_out":37}
{"sheet":"Snubber","index":2,"n_rows":33,"n_cols":11,"rows_kept":33,"cut":false,"hidden":false,"merged":[[7,5,7,8],[8,0,8,8],[9,3,9,8],[10,0,10,8],[0,0,0,8],[1,0,1,8],[2,5,2,8],[3,5,3,8],[5,5,5,8],[6,5,6,8]]}
["ALLEGRO ALT80802 DESIGN SPREADSHEET"]
["INSTRUCTIONS:   Enter design goals and component values in the white boxes."]
["VARIABLES","MIN","TYP","MAX","UNITS","COMMENTS"]
["LX resonance, FLX","‒",135,"‒","MHz","Measured LX resonant frequency"]
["LX resonance, TLX","‒",{"$f":"1000000000/(C4*1000000)","v":7.4074074074074074},"‒","ns","LX resonance period"]
["Capacitance of D1","‒",120,"‒","pF","Estimated D1 capacitance at VinTYP"]
["Capacitance, other","‒",50,"‒","pF","Estimated FET + PCB trace capacitance"]
["Snubber ‒3dB freq.","‒",2.5,"‒","Multiple of fLX","Start with 2.5, decrease for more damping"]
["**** Note:  The applications schematic is shown at the bottom of this TAB. ****\nSchematic component values are shown in BLUE."]
["COMPONENT","VALUE","UNITS","COMMENTS"]
["Snubber Component Calculations:"]
["LEQ",{"$f":"1000000000*(C5/1000000000)^2/(4*3.14^2*(C6/1000000000000+C7/1000000000000))","v":8.1839742483459119},"nH","Equivalent inductance, given fLX and CTOTAL"]
["RSNUB",{"$f":"SQRT(B12*0.000000001/(C6*0.000000000001+C7*0.000000000001))","v":6.9383733677476647},"Ω","Snubber resistance, use the closest available standard value"]
["RSNUB = ",6.81,"Ω","Enter the snubber resister value"]
["CSNUB",{"$f":"1000000000000/C8*(C5/1000000000)/B14","v":435.09000924566271},"pF","Snubber capacitance, use the closest available standard value"]
{"$rows_left_out":19}
{"sheet":"Constants","index":3,"n_rows":98,"n_cols":24,"rows_kept":98,"cut":false,"hidden":false,"merged":[[21,17,21,18],[1,5,1,8],[0,0,0,8],[56,7,56,8],[56,1,56,2],[0,17,0,20],[46,17,46,18],[0,22,0,23],[1,17,1,18],[1,19,1,20],[9,22,9,23],[8,17,8,18]]}
["These values are all derived from the data sheet or lab measurements.",null,null,null,null,null,null,null,null,null,null,null,null,null,null,null,null,"Std. Resistors",null,null,null,null,"C values up to 10nF"]
["PARAMETER","MIN","TYP","MAX","UNITS","COMMENTS",null,null,null,null,null,null,null,null,null,null,null,"E6",null,"E96",null,null,1,1.2]
["Input Voltage",3.8,null,50,"V","Datasheet values",null,null,null,null,null,null,null,null,null,null,null,100,150,100,102,null,1.2,1.5]
["VCS",0.192,0.2,0.20799999999999999,"V","Datasheet values",null,null,null,null,null,null,null,null,null,null,null,150,220,102,105,null,1.5,1.8]
["VCS tol",{"$f":"100*(B4-C4)/C4","v":-4.0000000000000036},"‒",{"$f":"100*(D4-C4)/C4","v":3.9999999999999893},"%","Calculated values",null,null,null,null,null,null,null,null,null,null,null,220,330,105,107,null,1.8,2.2000000000000002]
["UVLO Stop","‒",3,3.3,"V","Datasheet values",null,null,null,null,null,null,null,null,null,null,null,330,470,107,110,null,3.3,3.9]
["UVLO Hysteresis",300,"‒","‒","mV","Datasheet value",null,null,null,null,null,null,null,null,null,null,null,470,680,110,113,null,4.7,5.6]
["UVLO Multiplier","‒",0.5,"‒","‒","Chosen value, allows for margin",null,null,null,null,null,null,null,null,null,null,null,680,1000,113,115,null,6.8,8.1999999999999993]
["Maximum output Voltage ",16,18,20,"V","Datasheet values",null,null,null,null,null,null,null,null,null,null,null,"E12",null,115,118,null,8.1999999999999993,10]
["AVOL","‒",60,"‒","dB","Datasheet value",null,null,null,null,null,null,null,null,null,null,null,100,120,118,121,null,"C values greater than 10nF"]
["gm_EA",100,120,146,"µA/V","Datasheet values",null,null,null,null,null,null,null,null,null,null,null,120,150,121,124,null,1,1.5]
["Ro_EA",{"$f":"POWER(10,$C$10/20)/(D11/1000000)/1000000","v":6.8493150684931514},{"$f":"POWER(10,$C$10/20)/(C11/1000000)/1000000","v":8.3333333333333321},{"$f":"POWER(10,$C$10/20)/(B11/1000000)/1000000","v":10},"MΩ","Calculated values",null,null,null,null,null,null,null,null,null,null,null,150,180,124,127,null,1.5,2.2000000000000002]
["gm_power","‒",9,"‒","A/V","Datasheet value",null,null,null,null,null,null,null,null,null,null,null,180,220,127,130,null,2.2000000000000002,3.3]
["Slope comp @ 400kHz","‒",0.62,"‒","A/µs","Design supplied value",null,null,null,null,null,null,null,null,null,null,null,220,270,130,133,null,3.3,4.7]
["Slope Comp @ 2MHz","‒",3.1,"‒","A/µs","Datasheet values",null,null,null,null,null,null,null,null,null,null,null,270,330,133,137,null,4.7,6.8]
{"$rows_left_out":84}
{"sheet":"Sheet1","index":4,"n_rows":0,"n_cols":0,"rows_kept":0,"cut":false,"hidden":true,"merged":[]}